program: Gaussian 09
title: 000136419
version: EM64L-G09RevD.01
frameworkgroup: C1[X(C17H14O4)]
method: RPBEPBE
basis: SDD
operation: Freq
keyword: #pfreq=noraman
keyword: PBEPBE/SDD
title: #p freq=noraman PBEPBE/SDD
converged: YES YES NO NO
title: Mulliken charges:
elementType: O O O O C C C C C C C C C C C C C C C C C H H H H H H H H H H H H H H
charge: -0.232341 -0.257900 -0.251610 -0.264796 0.174999 0.176294 0.236463 0.043512 0.349435 -0.367724 -0.336764 -0.490123 0.356162 -0.388868 -0.366910 -0.371509 -0.363458 -0.371846 0.318862 -0.536178 -0.537660 0.280844 0.274961 0.284194 0.234843 0.277257 0.247089 0.249173 0.239838 0.250656 0.226657 0.226450 0.221576 0.224000 0.244421
chargesum: 0.00000
title: Mulliken charges with hydrogens summed into heavy atoms:
elementType: O O O O C C C C C C C C C C C C C C C C C
charge: -0.232341 -0.257900 -0.251610 -0.264796 0.174999 0.176294 0.236463 0.043512 0.349435 -0.086880 -0.061803 -0.205929 0.356162 -0.154025 -0.089652 -0.124420 -0.114285 -0.132008 0.318862 0.167586 0.152336
polarizability: 3.90580513e+02 -7.67817652e+00 1.82978283e+02 1.25051071e+00 3.07984004e+00 9.49720592e+01
1716.lowfreq: -7.3831 -4.4636 -0.0009 -0.0005 -0.0003 2.6525 25.4454 47.5456 53.4638
frequency: 25.3689 47.4816 53.4571 78.6890 97.5838 109.2287 132.0828 169.1871 191.8552 206.5981 220.5359 224.0510 238.0277 263.7196 298.4841 309.7537 337.7215 382.4825 389.9201 414.0242 428.6526 452.6662 482.0893 493.2231 528.6781 533.6443 537.9340 576.0750 604.9655 617.0044 634.9438 691.9518 706.4218 727.1989 743.5010 777.2599 782.7938 813.1427 828.4260 836.8629 856.8940 866.6932 871.5509 894.7826 942.5281 957.9577 980.4819 985.2453 989.8238 1001.0427 1027.4827 1074.7930 1111.6030 1113.0837 1117.2396 1132.5422 1156.9481 1164.8894 1168.4811 1185.6901 1216.4636 1235.2899 1251.9249 1273.2550 1306.8804 1316.6865 1344.1852 1372.8407 1392.0148 1423.8246 1435.4556 1436.3789 1444.0113 1466.0174 1469.0939 1471.2795 1473.5194 1486.4256 1501.7501 1540.0005 1551.5256 1571.8242 1598.3602 1620.9997 1633.5471 2960.9900 2969.1309 3049.5181 3061.3034 3125.4753 3127.7656 3132.7717 3153.2593 3154.7982 3166.6049 3175.5293 3187.3620 3188.7332 3191.4123
redmass: 5.9604 3.8454 4.9057 3.9351 4.1564 4.8033 4.9745 4.3021 4.3915 2.4210 1.2059 4.0138 2.0358 2.9502 4.2040 4.8681 7.1033 5.5286 4.7528 2.9879 4.2631 4.9287 3.3568 7.2168 6.0459 2.9773 4.7915 6.0796 5.8145 5.7669 6.7467 3.3958 6.7178 3.9874 5.4100 4.8403 3.5220 1.2928 1.5520 1.9208 5.7705 1.5967 1.4883 5.7331 1.3945 1.3549 1.3313 7.6537 5.4511 3.0231 3.1750 3.5442 1.2601 1.2564 1.3743 1.4564 1.3474 1.3972 2.5968 1.3852 2.1914 2.6363 5.7407 1.8486 1.3274 1.7190 3.0855 4.0764 7.1454 3.8139 1.1744 1.2997 3.6654 1.0503 1.0544 1.1218 1.0750 2.6032 2.5604 9.9064 7.0828 7.2474 8.0615 6.3567 7.3977 1.0329 1.0326 1.1040 1.1045 1.0995 1.0889 1.1001 1.0883 1.0892 1.0952 1.0953 1.0931 1.0949 1.0942
irintensity: 2.1652 1.3927 0.8315 0.4722 0.8671 14.2411 1.5543 7.8027 0.9592 2.0292 0.0600 0.1392 0.5093 1.3926 1.8458 0.5062 3.9448 1.8054 5.5734 0.2773 2.2286 4.5092 0.0596 1.9594 3.8896 23.1495 65.8755 9.9024 4.5498 2.9311 5.9050 6.4586 3.0279 4.5866 2.8767 13.2799 7.1159 12.7113 95.3473 10.5920 15.0739 27.4578 29.5401 16.6633 1.0073 0.8882 1.4170 53.6746 28.5941 50.3459 32.2660 60.2102 0.3413 0.1663 14.5999 4.7242 1.9204 3.5560 476.6592 49.4575 6.8424 93.1945 407.0363 17.3632 9.1639 11.3881 33.9483 13.8739 113.6686 0.2692 9.1330 26.7470 28.4447 13.8827 22.9390 106.5898 45.8290 8.5565 165.3116 94.2453 1.6496 16.6496 144.4007 81.0940 340.3900 79.7391 73.8201 47.6951 42.1726 30.7061 11.5463 23.1647 0.2301 13.9735 8.1971 13.1958 0.3546 2.4774 11.9540
temp: 298.150 k
press: 1.00000 atm
elementType: 8 8 8 8 6 6 6 6 6 6 6 6 6 6 6 6 6 6 6 6 6 1 1 1 1 1 1 1 1 1 1 1 1 1 1
symmnumber: 1
zpe: 700208.1 jmol-1
zpe.correction: 0.266695 hartree
zpe.thermalcorrener: 0.284834 hartree
zpe.thermalcorrenthalpy: 0.285778 hartree
zpe.thermalcorrgfe: 0.219970 hartree
zpe.sumelectzpe: -955.594894 hartree
zpe.sumelectthermal: -955.576755 hartree
zpe.sumelectthermalent: -955.575811 hartree
zpe.sumelectthermalfe: -955.641618 hartree
dipole: -2.3531 -0.6458 -0.7307
dipole: 2.5472
quadrupole: -76.9901 -117.8905 -124.8535
quadrupole: 2.8110 -6.5191 3.1093
quadrupole: 29.5879 -11.3124 -18.2755 2.8110 -6.5191 3.1093
hfenergy: -955.8615887 hartree
pointgroup: C01 [X(C17H14O4)]
dipole: 0.9315733 -0.0875404 0.3589005 debye
polarizability: 390.5202034|2.7485774|157.386066|-8.6506139|-40.0151161|120.624586 unknown
InChI: InChI=1S/C17H14O4/c1-19-12-5-3-11(4-6-12)15-10-21-16-9-13(20-2)7-8-14(16)17(15)18/h3-10H,1-2H3
charge 0 multiplicity 1
35 atoms
O  1.453716 1.813601 -0.648698
O  5.971271 0.363485 -0.254127
O  -0.061802 -1.808991 0.817862
O  -6.23424 0.171706 -0.115249
C  1.836104 -0.457188 0.206177
C  -0.500559 0.410732 -0.096959
C  2.336121 0.778674 -0.287339
C  0.380387 -0.706421 0.349826
C  -1.982983 0.300416 -0.08454
C  2.788201 -1.450316 0.554174
C  0.086471 1.583017 -0.529012
C  3.707156 1.041577 -0.43458
C  4.626319 0.030686 -0.079289
C  -2.768603 0.958875 -1.076861
C  -2.666373 -0.443294 0.913835
C  4.165717 -1.226262 0.418274
C  -4.170966 0.902574 -1.058413
C  -4.075579 -0.511003 0.943156
C  -4.833302 0.168491 -0.042223
C  6.981149 -0.644042 0.092669
C  -6.965946 -0.603437 0.890066
H  2.402386 -2.402222 0.933313
H  -0.469309 2.478402 -0.814497
H  4.058863 2.003283 -0.814445
H  -2.274311 1.493067 -1.896802
H  -2.086789 -0.982587 1.665851
H  4.872573 -2.01384 0.692836
H  -4.772447 1.399121 -1.825722
H  -4.56398 -1.093241 1.730058
H  7.945697 -0.164082 -0.125914
H  6.867289 -1.554257 -0.526197
H  6.929945 -0.9100 1.165607
H  -6.778654 -0.217178 1.910955
H  -6.697479 -1.676717 0.844732
H  -8.027845 -0.475132 0.634077
