program: Gaussian 09
title: 000136418
version: EM64L-G09RevD.01
frameworkgroup: C1[X(C23H18O10)]
method: RPBEPBE
basis: SDD
operation: Freq
keyword: #p
keyword: freq=noraman
keyword: PBEPBE/SDD
title: #p freq=noraman PBEPBE/SDD
converged: YES YES NO NO
title: Mulliken charges:
elementType: O O O O O O O O O O C C C C C C C C C C C C C C C C C C C C C C C H H H H H H H H H H H H H H H H H H
charge: -0.289415 -0.284317 -0.271817 -0.290829 -0.256579 -0.276922 -0.186163 -0.188395 -0.183913 -0.218089 0.141834 0.249303 0.240922 0.240996 0.198658 0.051548 -0.620199 0.351578 -0.428568 0.351408 -0.334265 -0.366673 -0.396060 -0.333714 0.350637 0.281892 0.267886 0.260600 -0.752115 -0.744076 -0.742877 0.263589 -0.747599 0.284869 0.251794 0.270445 0.234965 0.260307 0.306350 0.241277 0.239727 0.290704 0.252282 0.248279 0.259577 0.255131 0.250873 0.254506 0.255241 0.250023 0.255384
chargesum: 0.00000
title: Mulliken charges with hydrogens summed into heavy atoms:
elementType: O O O O O O O O O O C C C C C C C C C C C C C C C C C C C C C C C
charge: -0.289415 -0.284317 -0.271817 -0.290829 -0.256579 -0.276922 -0.186163 -0.188395 -0.183913 -0.218089 0.141834 0.249303 0.240922 0.240996 0.198658 0.051548 -0.335330 0.351578 -0.176775 0.351408 -0.063820 -0.131708 -0.135753 -0.027364 0.350637 0.281892 0.267886 0.260600 0.019593 0.016062 0.017633 0.263589 0.013049
polarizability: 5.17478317e+02 1.50553078e+01 3.12808282e+02 1.46870454e+00 -3.27345088e+00 1.62011060e+02
1716.lowfreq: -0.0007 -0.0003 0.0010 0.7330 4.2760 5.5375 15.0548 21.3915 34.9522
frequency: 14.9330 21.2955 34.9454 37.0948 40.4490 41.4294 47.2633 49.8815 54.1544 55.9716 62.3759 72.9866 84.6615 87.6924 89.6181 90.9666 97.4126 116.6735 128.6191 130.9139 135.8171 163.2010 175.2784 198.4905 230.4726 248.3305 260.5408 271.2896 279.8219 295.6321 299.5189 323.6126 338.2618 339.2806 383.6206 387.9909 406.5656 408.5314 439.8128 474.8830 499.8619 503.1690 506.9436 527.1942 536.1026 538.7513 547.3124 551.4362 553.8603 570.0651 588.9907 612.1913 626.1292 628.7209 637.7391 640.6006 672.1757 673.8557 698.6783 719.6275 739.7333 748.0570 762.2137 774.5781 803.2999 816.5633 840.7081 862.0187 871.1837 873.6565 881.0057 883.3557 891.8872 977.2954 979.3312 981.3297 982.0545 988.6596 990.3992 992.4717 1008.7257 1029.6572 1036.4575 1038.8294 1040.5421 1040.5977 1057.8004 1124.0327 1126.6056 1145.2719 1149.0504 1157.5145 1166.7542 1173.9033 1183.9139 1212.5440 1254.7937 1266.2709 1299.6756 1303.6270 1315.7789 1375.3036 1376.8458 1383.6130 1385.4949 1385.9971 1387.6125 1415.9385 1422.5475 1444.5067 1447.0243 1450.7211 1451.2882 1451.8189 1452.6112 1453.0025 1453.0829 1456.7121 1490.7437 1543.9208 1566.8188 1576.4607 1611.6339 1619.5773 1624.1727 1667.1019 1701.4864 1704.9526 1712.9929 3009.5927 3009.6051 3010.8904 3012.4394 3097.3481 3098.7531 3099.3805 3107.4648 3142.8477 3145.4554 3146.5048 3146.8161 3154.6781 3164.8273 3187.5305 3191.4050 3192.1608 3213.7496
redmass: 6.4170 5.0008 7.1482 5.6810 4.1846 5.1363 2.7313 5.4029 3.7569 2.7016 3.1456 1.2875 1.5760 1.5328 4.0851 3.2539 3.3442 1.1623 7.4763 6.5222 7.7029 8.5448 6.9365 6.0341 6.6565 9.4334 4.5581 5.4422 5.1059 5.6647 8.3567 5.9490 7.2966 5.2807 5.0199 5.6914 6.2064 2.9757 5.0468 6.1006 5.1879 3.5284 3.3036 5.5466 5.1019 4.1419 3.4331 5.2601 3.1483 6.1672 6.5743 5.9920 5.5696 6.0657 5.4897 4.4543 6.5259 6.1030 6.6609 5.1627 3.8479 6.5771 5.9514 5.8453 6.9255 5.4481 1.3148 1.6065 1.6780 1.8479 7.3090 7.3239 6.0624 2.6246 2.5505 1.3985 2.7092 1.3577 2.2739 2.1895 2.8692 2.6376 1.8811 1.7258 2.0880 1.6423 7.5358 1.3351 3.2129 2.6548 2.5317 2.0169 2.7383 2.7967 2.8594 1.5988 2.1242 3.0353 5.3795 2.2617 2.2711 1.2520 5.8099 1.2457 1.2651 1.2472 8.0752 8.6492 4.0023 4.9827 1.0636 1.0524 1.0590 1.0504 1.0579 1.0633 1.0463 1.0518 2.5864 10.4986 8.9896 8.0588 7.5741 7.0130 8.5845 9.8076 10.5819 10.7318 11.0027 1.0369 1.0374 1.0369 1.0357 1.0973 1.0971 1.0958 1.0968 1.1022 1.1020 1.1011 1.1014 1.0909 1.0890 1.0962 1.0932 1.0918 1.0946
irintensity: 0.2328 1.8080 0.1375 0.3107 3.0589 0.4838 2.1714 0.7447 1.1820 2.8584 3.3285 1.2343 0.8169 1.6187 0.4914 4.3599 3.9125 0.6748 0.5056 1.2686 1.3425 2.8673 0.1647 2.7062 5.2215 1.1437 9.0095 5.1410 4.1330 0.2446 1.2354 0.1806 1.1685 3.5892 4.7363 6.4413 4.9918 0.0745 11.7239 3.6494 8.2918 9.0216 9.1751 1.9668 4.2908 28.9633 5.3602 3.1770 0.3650 7.1679 9.7652 20.0953 3.9206 6.2464 4.6525 19.0823 28.5357 20.9627 17.2893 38.7337 6.2070 26.0037 64.7728 15.5397 64.2613 27.1316 1.3190 84.6350 4.6103 65.2547 11.0447 117.9836 110.0288 14.5038 148.2849 7.9268 53.5585 4.8220 417.3830 9.0605 77.8673 137.2366 31.3700 44.3126 128.2666 9.9970 144.8417 29.6727 220.7596 572.3191 1287.6917 22.2104 242.2081 194.0084 9.2909 46.8968 21.9926 2.3395 82.8236 109.6390 229.9794 106.5389 97.5934 63.6033 100.3397 57.9956 8.7886 183.7327 34.6052 15.9911 6.4105 16.8965 24.5751 32.0221 18.6779 14.5912 19.9860 16.7269 114.0802 200.7083 25.0755 36.6471 410.5411 4.5951 247.0086 197.8784 25.5391 161.7707 274.0067 0.6000 0.9413 0.8716 2.5058 5.4571 4.8900 6.3288 6.9457 10.3245 9.2532 11.8660 9.3623 5.5325 3.9285 2.3144 1.8043 3.1817 3.6118
temp: 298.150 k
press: 1.00000 atm
elementType: 8 8 8 8 8 8 8 8 8 8 6 6 6 6 6 6 6 6 6 6 6 6 6 6 6 6 6 6 6 6 6 6 6 1 1 1 1 1 1 1 1 1 1 1 1 1 1 1 1 1 1
symmnumber: 1
zpe: 952055.7 jmol-1
zpe.correction: 0.362619 hartree
zpe.thermalcorrener: 0.395223 hartree
zpe.thermalcorrenthalpy: 0.396167 hartree
zpe.thermalcorrgfe: 0.293376 hartree
zpe.sumelectzpe: -1637.147572 hartree
zpe.sumelectthermal: -1637.114968 hartree
zpe.sumelectthermalent: -1637.114024 hartree
zpe.sumelectthermalfe: -1637.216815 hartree
dipole: 1.2769 5.2293 -1.5304
dipole: 5.5962
quadrupole: -127.9534 -169.6874 -209.7486
quadrupole: 10.7299 3.5611 -1.4672
quadrupole: 41.1764 -0.5576 -40.6188 10.7299 3.5611 -1.4672
hfenergy: -1637.5101907 hartree
pointgroup: C01 [X(C23H18O10)]
dipole: 0.6091483 2.0765958 -0.4053573 debye
polarizability: 518.4795861|4.211679|311.0785864|2.3759779|10.8997095|162.739486 unknown
InChI: InChI=1S/C23H18O10/c1-11(24)29-16-7-5-15(6-8-16)18-9-17(28)21-19(33-18)10-20(30-12(2)25)22(31-13(3)26)23(21)32-14(4)27/h5-10H,1-4H3
charge 0 multiplicity 1
51 atoms
O  0.888446 0.607294 0.003262
O  -3.418672 -1.803832 -0.293017
O  -4.720067 0.62386 -0.024045
O  -3.246252 3.028819 0.051034
O  -0.937144 -3.120184 -0.436146
O  7.240834 0.686513 0.010266
O  -2.852127 -2.659219 1.826438
O  -4.876027 0.107387 -2.315129
O  -4.106024 2.696775 2.215908
O  8.319071 -1.411784 -0.067878
C  -1.202768 -0.709841 -0.125745
C  -0.514839 0.531055 -0.013774
C  -2.628296 -0.655017 -0.134758
C  1.655736 -0.561521 -0.12815
C  -0.411928 -1.963933 -0.28864
C  -3.308407 0.576669 -0.057718
C  -1.174199 1.770439 0.085211
C  -2.573291 1.782724 0.053362
C  1.038179 -1.783464 -0.279633
C  3.103791 -0.284362 -0.08967
C  3.58126 1.055577 -0.031567
C  4.054854 -1.339848 -0.110024
C  4.958798 1.323734 -0.000821
C  5.439939 -1.089062 -0.079991
C  5.884819 0.255481 -0.026557
C  -3.320933 -2.861102 0.700332
C  -5.437061 0.28111 -1.225156
C  -4.06671 3.376171 1.182015
C  -3.915975 -4.115976 0.129296
C  -6.906333 0.189108 -0.900904
C  -4.792705 4.661948 0.874565
C  8.374448 -0.16896 -0.013416
C  9.621405 0.682214 0.036179
H  -0.607333 2.699161 0.172493
H  1.633102 -2.690307 -0.401243
H  2.864482 1.879714 -0.012174
H  3.723143 -2.382205 -0.142325
H  5.336452 2.349259 0.042365
H  6.1547 -1.911568 -0.094924
H  -4.810952 -3.892516 -0.473307
H  -4.155269 -4.823356 0.936627
H  -3.157339 -4.560375 -0.538746
H  -7.218078 1.033592 -0.264884
H  -7.493835 0.166655 -1.829863
H  -7.09384 -0.736931 -0.328212
H  -4.073236 5.444295 0.578802
H  -5.36192 4.987524 1.756615
H  -5.47778 4.510812 0.022187
H  9.653213 1.359419 -0.834954
H  10.509324 0.034352 0.036751
H  9.616042 1.3135 0.94136
