program: Gaussian 09
title: 000136416
version: EM64L-G09RevD.01
frameworkgroup: C1[X(C8H8BrNO)]
method: RPBEPBE
basis: SDD
operation: Freq
keyword: #p
keyword: freq=noraman
keyword: PBEPBE/SDD
title: #p freq=noraman PBEPBE/SDD
converged: NO NO NO NO
title: Mulliken charges:
elementType: Br O N C C C C C C C C H H H H H H H H
charge: -0.000835 -0.253214 -0.436942 0.607892 -0.444810 -0.332504 -0.188582 -0.217269 -0.248689 0.215303 -0.794897 0.316888 0.307365 0.249414 0.233497 0.237146 0.242403 0.267742 0.240092
chargesum: 0.00000
title: Mulliken charges with hydrogens summed into heavy atoms:
elementType: Br O N C C C C C C C C
charge: -0.000835 -0.253214 -0.129576 0.607892 -0.444810 -0.015616 0.060832 0.016228 -0.011543 0.215303 -0.044660
polarizability: 1.43880802e+02 -6.32839543e+00 1.46631131e+02 3.25170945e-03 -4.25860452e-02 4.71696831e+01
1716.lowfreq: -21.8633 -0.0003 0.0004 0.0006 11.7942 14.3453 19.3389 69.0578 91.4677
frequency: -17.4951 68.9938 91.4445 119.9511 149.2151 216.7764 263.5118 276.6098 352.5282 389.8654 440.7587 526.6018 532.7039 587.6716 633.7025 669.1055 686.0924 727.7215 763.3161 820.1727 878.4523 931.1345 955.3545 987.1773 993.6507 1000.3450 1034.2172 1042.4482 1122.2945 1171.8500 1220.3178 1244.4121 1302.0316 1361.4794 1378.5426 1419.9834 1443.1880 1457.7695 1467.6350 1508.1457 1572.2093 1603.8615 1634.9905 2985.3985 3070.8473 3132.2197 3138.6409 3154.8979 3172.1895 3185.5139 3472.2728
redmass: 1.0688 6.3617 3.3446 6.2762 4.4670 7.2481 7.6526 4.3490 4.2291 6.6449 3.4275 4.4900 3.3192 3.0437 6.1508 6.1932 1.2728 3.2242 1.2581 4.5745 1.3468 6.5559 1.3573 1.9104 4.7685 1.3142 1.6567 1.9332 1.6030 1.0597 3.2209 1.5339 1.8888 5.9412 1.2484 2.3910 1.5729 1.5045 1.0467 2.1664 5.1250 6.7921 5.0193 1.0381 1.0984 1.0983 1.0865 1.0918 1.0979 1.0960 1.0765
irintensity: 0.1245 10.7208 0.6201 4.7789 0.7452 3.5521 1.6452 3.3701 4.7700 0.0992 12.4192 17.7480 4.9190 0.1741 7.3231 16.0426 52.2545 2.9831 111.9869 0.5669 5.8168 6.0892 5.3907 30.8476 44.3123 4.0123 8.4542 9.5654 0.5606 0.1892 65.7401 14.1339 64.8758 130.0923 61.9572 132.6839 15.4180 33.9035 19.9931 380.2653 20.3690 89.3667 106.2487 6.1236 13.6437 7.4772 4.0636 11.5906 8.4128 13.8196 54.5080
temp: 298.150 k
press: 1.00000 atm
elementType: 35 8 7 6 6 6 6 6 6 6 6 1 1 1 1 1 1 1 1
symmnumber: 1
zpe: 372996.9 jmol-1
zpe.correction: 0.142067 hartree
zpe.thermalcorrener: 0.151880 hartree
zpe.thermalcorrenthalpy: 0.152824 hartree
zpe.thermalcorrgfe: 0.105309 hartree
zpe.sumelectzpe: -452.308399 hartree
zpe.sumelectthermal: -452.298586 hartree
zpe.sumelectthermalent: -452.297642 hartree
zpe.sumelectthermalfe: -452.345157 hartree
dipole: -1.2834 -1.4924 0.0178
dipole: 1.9684
quadrupole: -76.3341 -64.9361 -77.3234
quadrupole: -12.2589 0.0539 0.0015
quadrupole: -3.4696 7.9284 -4.4588 -12.2589 0.0539 0.0015
hfenergy: -452.4504661 hartree
pointgroup: C01 [X(C8H8Br1N1O1)]
dipole: -0.2165387 0.7435202 -0.0064809 debye
dipolederiv: -0.1317842 -0.0745634 -0.0001224 -0.0439946 -0.6603878 -0.0007963 -0.0001075 -0.0007556 -0.0318784 -0.7547717 0.0128458 0.0000227 0.5492695 -0.9070836 0.0017715 0.000874 0.001496 -0.3394013 -1.9414175 0.1463023 -0.0003885 0.2513645 -0.4322264 -0.0004745 -0.0006652 0.0003343 -0.3037547 1.058286 -0.0098828 0.0008661 0.5163132 -0.2359824 0.0001482 0.0014919 -0.0000528 0.1311538 -0.1929829 0.1322138 0.0001109 0.1427693 1.1092523 0.0015276 -0.0001188 0.0013664 -0.1659098 -0.2161053 0.1228462 0.0002004 -0.2528 -0.0587124 0.0001127 0.0002844 0.0001529 -0.1600702 0.0201645 0.0064276 0.0001401 -0.1531595 -0.2245511 -0.0002284 -0.0001167 -0.0001546 -0.0785355 0.0703003 -0.0409682 0.0000675 0.0526604 0.1533767 0.0002885 0.0001832 0.0001159 -0.1416398 -0.0495528 -0.0110394 0.0001344 0.0693826 -0.0639477 0.0001237 0.0002284 0.0000115 -0.1798924 1.9679553 -0.1567592 -0.0015474 -0.7832442 1.137371 -0.0037375 -0.0074044 -0.0045071 0.1756521 -0.3370992 -0.1523726 0.0004237 -0.2940854 -0.1634893 0.0043362 0.01093 0.0071866 0.0543399 0.1496198 0.0369918 -0.0000396 0.0308531 0.0721312 -0.0001744 0.0000578 0.0000495 0.1858357 0.2496401 -0.0537653 -0.0003067 -0.1228272 0.1926326 -0.0000454 -0.0002652 -0.0005542 0.28568 0.0177016 0.0719438 -0.0000204 0.0919851 0.0294042 -0.0000896 -0.000014 -0.0000378 0.1619683 0.077515 -0.0293648 -0.0000985 -0.0513408 -0.1030233 -0.0003001 -0.0001969 -0.0002043 0.158186 -0.0873229 -0.064049 -0.0002393 -0.0608719 0.0421884 -0.0001802 -0.0002438 -0.0001176 0.1715942 0.0650662 0.005124 -0.0424465 -0.0285929 0.0397173 0.0949667 0.0030455 0.1034672 -0.0329814 -0.0300954 0.0456231 -0.0043681 0.1110907 0.0469612 0.0041054 -0.0080852 0.0016417 0.1307692 0.0648829 0.0124462 0.0476119 -0.024772 0.0263691 -0.1013544 0.0001226 -0.1094378 -0.0211155 unknown
polarizability: 149.1216678|5.1957742|141.3902662|0.0123203|0.0390418|47.169682 unknown
InChI: InChI=1S/C8H8BrNO/c1-6(11)10-8-5-3-2-4-7(8)9/h2-5,10H,1H3
charge 0 multiplicity 1
19 atoms
Br -0.909125 2.862121 0.00422
O  2.514682 -1.420893 0.005915
N  1.200624 0.532709 0.003149
C  -0.115831 0.009917 0.001666
C  -1.225103 0.906755 0.001846
C  -0.399256 -1.386227 -0.000036
C  -2.555593 0.454994 0.000383
C  -1.732504 -1.843539 -0.001505
C  -2.815412 -0.935147 -0.001316
C  2.420488 -0.159755 0.003689
C  3.637995 0.766316 -0.001097
H  0.447519 -2.075746 -0.000128
H  1.257221 1.556887 0.003291
H  -3.376046 1.178767 0.000562
H  -1.921095 -2.922684 -0.002791
H  -3.850512 -1.291482 -0.002426
H  3.661507 1.388548 -0.915513
H  4.547036 0.148088 0.031174
H  3.632304 1.442271 0.874519
