program: Gaussian 09
title: 000136392
version: EM64L-G09RevD.01
frameworkgroup: C1[X(C13H28O)]
method: RPBEPBE
basis: SDD
operation: Freq
keyword: #pfreq=noraman
keyword: PBEPBE/SDD
title: #p freq=noraman PBEPBE/SDD
converged: YES YES NO NO
title: Mulliken charges:
elementType: O C C C C C C C C C C C C C H H H H H H H H H H H H H H H H H H H H H H H H H H H H
charge: -0.459022 0.341048 -0.506448 -0.481755 -0.481571 -0.382038 -0.362074 -0.362006 -0.350846 -0.358588 -0.358791 -0.701251 -0.699083 -0.699020 0.225495 0.225582 0.206301 0.186497 0.186392 0.206440 0.200752 0.200711 0.218482 0.197138 0.218508 0.197066 0.317999 0.197574 0.197620 0.192235 0.192175 0.192288 0.192193 0.209549 0.209546 0.217230 0.212606 0.214414 0.209822 0.212604 0.209814 0.214411
chargesum: 0.00000
title: Mulliken charges with hydrogens summed into heavy atoms:
elementType: O C C C C C C C C C C C C C
charge: -0.141023 0.341048 -0.055370 -0.088957 -0.088739 0.019425 0.053546 0.053568 0.044349 0.025822 0.025690 -0.064927 -0.062241 -0.062190
polarizability: 1.66083876e+02 -4.74311067e-03 1.46692705e+02 4.70981909e-03 1.87417910e-01 1.23413059e+02
1716.lowfreq: -8.1381 -0.0006 0.0002 0.0005 9.5777 13.1503 36.2894 40.4130 52.0442
frequency: 36.1788 40.3006 52.0411 61.6997 64.4325 66.3356 88.3607 119.7409 126.5704 146.3834 157.4459 183.5890 226.8764 231.6191 231.7424 234.9085 246.6623 301.4149 302.5237 316.1032 324.0558 341.1750 391.0602 444.0253 482.9747 508.4090 593.6042 728.1863 728.8610 729.3267 764.0361 770.0002 790.7572 797.4518 879.3676 889.4616 894.6152 897.6177 899.6569 930.2038 963.1480 976.8014 1023.7843 1031.8786 1039.3430 1071.3468 1071.7018 1079.1036 1086.9980 1095.2008 1099.2506 1103.4491 1129.2191 1155.1589 1167.5775 1210.0944 1210.4453 1219.4237 1254.0856 1261.0489 1262.2946 1275.3248 1277.7787 1283.5790 1289.2771 1291.5136 1293.4618 1324.9774 1333.4670 1338.0135 1348.0372 1355.8990 1359.7365 1375.5992 1388.6751 1388.8963 1392.0108 1455.5423 1462.7278 1466.1681 1466.7958 1467.8829 1470.8562 1476.6296 1476.9681 1477.3704 1479.0421 1479.0738 1482.2221 1486.7754 1487.4935 1490.9131 2937.2375 2944.9354 2958.4769 2958.7372 2959.0324 2967.9078 2970.8676 2971.3985 2971.8437 2972.1100 2973.3437 2994.6760 2997.7866 2998.1692 3000.0609 3003.0607 3008.9813 3022.8777 3039.4534 3042.4319 3052.3330 3067.6487 3068.7267 3068.8045 3070.3059 3070.4002 3070.5023 3534.8098
redmass: 3.4122 3.3731 1.4860 2.7073 1.5022 1.7957 2.9539 2.6505 3.1810 2.2299 2.7626 2.1313 3.2175 1.1248 1.1174 1.1121 3.6401 3.7117 2.7491 1.0940 2.9589 2.3845 2.7853 2.7297 2.6464 2.8544 3.1640 1.0914 1.0831 1.1531 2.3401 1.2185 1.1901 1.6188 2.0526 1.6776 1.7945 1.4582 1.7654 1.2949 1.4766 2.0557 2.9397 2.0148 3.0946 2.3297 2.4269 2.2334 2.2703 1.6002 1.6596 1.8006 1.8258 2.8126 2.0602 1.5004 1.4300 1.3669 1.3019 1.3012 1.3185 1.1723 1.3283 1.2220 1.0921 1.0927 1.0739 1.4064 1.4188 1.5470 1.6083 1.6490 1.5834 1.7002 1.2179 1.2201 1.2276 1.0794 1.0716 1.0675 1.0768 1.0717 1.0730 1.0553 1.0430 1.0564 1.0424 1.0682 1.0642 1.0816 1.0816 1.0917 1.0645 1.0638 1.0589 1.0589 1.0582 1.0593 1.0559 1.0399 1.0382 1.0410 1.0551 1.0946 1.0641 1.0964 1.0931 1.0998 1.0958 1.1024 1.1032 1.1028 1.1022 1.1006 1.1004 1.1005 1.0995 1.0994 1.0992 1.0655
irintensity: 0.0002 0.0118 0.0358 0.0567 0.0106 0.0385 0.3097 0.6316 0.6207 0.2224 1.4954 1.4510 0.0864 0.0040 0.0069 0.0017 0.2212 3.3902 0.9211 119.2268 1.4408 52.8626 0.5770 4.0424 2.1624 6.3935 3.6429 12.0169 0.5696 10.1901 11.8681 0.2716 0.0092 0.3241 13.6309 3.6039 10.3136 6.3809 6.4164 0.0073 40.2019 1.5167 3.4674 0.0087 0.4487 1.1919 6.4551 8.4742 2.4849 1.4301 12.2611 8.7373 30.2296 1.8433 7.9321 5.1425 0.0698 1.0876 1.8442 10.2949 7.7540 0.2657 10.5312 13.7705 3.8309 0.1293 0.0470 8.9569 0.6266 18.7888 3.7330 0.0033 0.5648 6.5749 16.2501 9.3954 10.7423 2.5835 0.0997 0.6583 0.1233 0.9475 5.2400 2.0059 24.2313 0.3769 13.0745 7.8481 1.3217 55.7768 1.8011 0.3263 1.7322 37.4263 1.7235 41.2301 3.4174 41.6794 6.2849 36.6660 8.2079 63.1775 130.6091 0.2638 30.8297 1.0295 31.2038 1.7521 10.9879 13.1855 5.6405 91.3660 46.5159 92.9862 172.7422 13.0939 32.1457 51.3490 74.3942 3.8754
temp: 298.150 k
press: 1.00000 atm
elementType: 8 6 6 6 6 6 6 6 6 6 6 6 6 6 1 1 1 1 1 1 1 1 1 1 1 1 1 1 1 1 1 1 1 1 1 1 1 1 1 1 1 1
symmnumber: 1
zpe: 1008875.2 jmol-1
zpe.correction: 0.384260 hartree
zpe.thermalcorrener: 0.403537 hartree
zpe.thermalcorrenthalpy: 0.404481 hartree
zpe.thermalcorrgfe: 0.335723 hartree
zpe.sumelectzpe: -586.208837 hartree
zpe.sumelectthermal: -586.189561 hartree
zpe.sumelectthermalent: -586.188616 hartree
zpe.sumelectthermalfe: -586.257375 hartree
dipole: -0.0015 -0.3770 -1.5992
dipole: 1.6431
quadrupole: -92.7858 -87.2875 -96.4151
quadrupole: -0.0052 -0.0083 1.5788
quadrupole: -0.6230 4.8753 -4.2523 -0.0052 -0.0083 1.5788
hfenergy: -586.5930978 hartree
pointgroup: C01 [X(C13H28O1)]
dipole: -0.0049297 -0.1335211 -0.6324672 debye
polarizability: 166.0805254|-0.2219137|146.6737379|-0.1780217|0.733698|123.4353764 unknown
InChI: InChI=1S/C13H28O/c1-4-7-10-13(14,11-8-5-2)12-9-6-3/h14H,4-12H2,1-3H3
charge 0 multiplicity 1
42 atoms
O  -0.0079 -1.599838 1.393727
C  -0.005422 -0.684302 0.211394
C  0.009992 0.72014 0.857075
C  -1.281142 -0.957858 -0.637174
C  1.256924 -0.980298 -0.649632
C  0.01485 1.904911 -0.133302
C  -2.622038 -0.724891 0.091818
C  2.608775 -0.77507 0.067453
C  0.028326 3.271812 0.589499
C  -3.833137 -1.256291 -0.708596
C  3.801852 -1.331336 -0.74299
C  0.031375 4.468854 -0.38514
C  -5.180446 -0.997787 -0.000054
C  5.159953 -1.100133 -0.045689
H  -0.868676 0.797073 1.525004
H  0.89625 0.782385 1.516488
H  -1.246122 -0.341039 -1.55813
H  -1.237948 -2.015481 -0.98084
H  1.190172 -2.036089 -0.995067
H  1.225079 -0.360817 -1.568906
H  0.899803 1.844252 -0.799729
H  -0.876601 1.857604 -0.792052
H  -2.584387 -1.216935 1.083844
H  -2.765995 0.357967 0.281875
H  2.569427 -1.266234 1.059831
H  2.776805 0.304546 0.255976
H  -0.018297 -2.532393 1.053903
H  -0.854513 3.337733 1.257708
H  0.919013 3.325326 1.248307
H  -3.846346 -0.786434 -1.713874
H  -3.70745 -2.345757 -0.878014
H  3.816292 -0.862052 -1.748517
H  3.652669 -2.418058 -0.910931
H  -0.865543 4.455165 -1.033173
H  0.9199 4.44181 -1.044252
H  0.041998 5.432831 0.156049
H  -5.202077 -1.480554 0.995095
H  -6.030826 -1.391972 -0.58657
H  -5.347097 0.085617 0.150924
H  5.180273 -1.583685 0.94912
H  5.349338 -0.020325 0.104225
H  5.997399 -1.510897 -0.639383
