program: Gaussian 09
title: 000136385
version: EM64L-G09RevD.01
frameworkgroup: C1[X(C3H6N2O4)]
method: RPBEPBE
basis: SDD
operation: Freq
keyword: #pfreq=noraman
keyword: PBEPBE/SDD
title: #p freq=noraman PBEPBE/SDD
converged: YES YES NO NO
title: Mulliken charges:
elementType: O O O O N N C C C H H H H H H
charge: -0.168591 -0.178203 -0.178211 -0.168599 0.117933 0.118005 0.278911 -0.662031 -0.662127 0.273712 0.231467 0.246245 0.246305 0.273709 0.231474
chargesum: 0.00000
title: Mulliken charges with hydrogens summed into heavy atoms:
elementType: O O O O N N C C C
charge: -0.168591 -0.178203 -0.178211 -0.168599 0.117933 0.118005 0.278911 0.089393 0.089361
polarizability: 6.77389002e+01 -1.81277526e-02 5.85758836e+01 -9.46331595e+00 2.70019897e-03 6.35776494e+01
1716.lowfreq: 0.0006 0.0010 0.0012 2.6987 12.1022 17.6749 51.4288 55.7236 167.1259
frequency: 51.3673 55.7162 167.1251 199.5158 231.8014 254.0878 271.1658 325.9892 337.3913 392.2894 438.8283 504.8998 592.3835 659.3777 688.8277 751.2287 762.0562 913.6006 950.6410 1003.6221 1137.0801 1175.6762 1184.2539 1227.9515 1253.9389 1383.5789 1403.6022 1418.5111 1425.2497 1448.7695 1461.9017 1467.4824 1477.3952 3013.3587 3015.8190 3113.0103 3117.6676 3134.0752 3135.0215
redmass: 9.7913 14.0483 7.6467 1.0754 1.0823 2.9443 4.4223 3.2763 2.7098 10.5525 7.4289 5.1152 4.0229 4.7998 8.3979 9.2485 12.4969 2.7783 1.3868 1.2917 1.9459 2.0599 11.0049 12.0927 5.0818 1.2952 1.3143 3.4900 7.3613 1.0501 1.2107 1.0688 1.0490 1.0360 1.0364 1.1001 1.0991 1.1009 1.1014
irintensity: 0.8279 0.0131 5.0313 0.1778 0.2771 0.0361 4.0476 1.5319 3.4201 1.3077 5.2205 6.2139 0.4512 0.4997 2.0696 61.8946 14.3323 0.0075 1.3389 0.0570 1.4887 15.9715 131.8033 41.8410 20.1032 103.7871 52.2857 30.1960 179.0096 10.7766 3.6180 7.3110 34.1284 1.7015 6.3619 0.7255 7.7885 2.5878 2.8742
temp: 298.150 k
press: 1.00000 atm
elementType: 8 8 8 8 7 7 6 6 6 1 1 1 1 1 1
symmnumber: 1
zpe: 272427.1 jmol-1
zpe.correction: 0.103762 hartree
zpe.thermalcorrener: 0.113316 hartree
zpe.thermalcorrenthalpy: 0.114261 hartree
zpe.thermalcorrgfe: 0.068779 hartree
zpe.sumelectzpe: -527.429693 hartree
zpe.sumelectthermal: -527.420139 hartree
zpe.sumelectthermalent: -527.419195 hartree
zpe.sumelectthermalfe: -527.464676 hartree
dipole: -0.0029 4.7630 -0.0026
dipole: 4.7630
quadrupole: -62.0066 -51.2131 -51.9346
quadrupole: -0.0022 0.8450 -0.0033
quadrupole: -6.9551 3.8383 3.1168 -0.0022 0.8450 -0.0033
hfenergy: -527.5334551 hartree
pointgroup: C01 [X(C3H6N2O4)]
dipole: 0.0077582 -1.8712215 -0.1001026 debye
dipolederiv: -0.6203628 -0.0088749 -0.2972869 0.1347791 -0.2934724 -0.1125236 -0.1723423 -0.2051754 -0.4754586 -0.4263797 -0.1276764 -0.0214309 -0.0627272 -0.489414 0.3078617 -0.097182 0.2211226 -0.49715 -0.4281647 0.1290194 -0.0053392 0.0723424 -0.4321391 -0.3011777 -0.0883456 -0.2149095 -0.5521202 -0.6193606 0.0371829 -0.2960724 -0.1183568 -0.3294949 0.1255148 -0.1875554 0.2190825 -0.4406606 1.0081664 -0.2303421 0.325538 -0.3576354 0.4436082 0.4444319 0.2788631 0.4577956 0.7583888 1.003478 0.199614 0.3521273 0.3308839 0.546506 -0.4643334 0.3190764 -0.4781505 0.6615293 -0.0316633 0.0035419 -0.0977888 0.0057795 0.3685895 -0.0025579 -0.1377135 -0.0026379 0.4063768 -0.0629215 -0.0197599 0.0018526 -0.0319345 -0.0561184 -0.023849 0.0337128 -0.0175127 -0.1449035 -0.0633863 0.0192942 0.0039761 0.0277601 -0.0611389 0.0329132 0.0367875 0.0267632 -0.1393822 0.1222965 -0.0069681 -0.0156505 0.0082697 0.0362379 0.0827245 0.0004271 0.0420297 0.0270462 -0.0161844 0.1055474 0.0227847 0.0911305 0.0502335 -0.0254501 -0.0017381 -0.0109564 0.0940068 0.0140917 -0.0992506 0.0098674 -0.0802602 0.0600031 0.0113801 0.009633 -0.0097506 0.0958784 0.0125957 0.0972096 0.0205121 0.0784131 0.0620022 -0.0149402 0.0180526 0.0062429 0.095325 0.1223312 0.0092978 -0.0141442 -0.0075308 0.0493866 -0.0804816 -0.0000318 -0.0396392 0.0137373 -0.0145362 -0.1078353 0.0110547 -0.0909132 0.0452106 0.0204874 -0.0116439 0.0056959 0.0973864 unknown
polarizability: 66.6681785|-0.4632177|58.5885452|9.6254298|-0.2775585|64.6357094 unknown
InChI: InChI=1S/C3H6N2O4/c1-3(2,4(6)7)5(8)9/h1-2H3
charge 0 multiplicity 1
15 atoms
O  -2.209926 0.221092 -0.652608
O  1.156173 1.253321 -1.034935
O  -1.164066 1.127068 1.163251
O  2.208857 0.169891 0.676786
N  -1.230821 0.327853 0.162469
N  1.229148 0.353953 -0.123691
C  0.0032 -0.636647 -0.033062
C  -0.103066 -1.375217 -1.364653
C  0.116104 -1.512799 1.211681
H  -0.193917 -0.666721 -2.202034
H  0.797688 -1.996738 -1.507583
H  -0.988814 -2.029667 -1.356168
H  1.007246 -2.155242 1.134154
H  0.201139 -0.897551 2.120383
H  -0.779446 -2.153497 1.286509
