program: Gaussian 09
title: 000136349
version: EM64L-G09RevD.01
frameworkgroup: C1[X(C7H5F4N)]
method: RPBEPBE
basis: SDD
operation: Freq
keyword: #pfreq=noraman
keyword: PBEPBE/SDD
title: #p freq=noraman PBEPBE/SDD
converged: NO NO NO NO
title: Mulliken charges:
elementType: F F F F N C C C C C C C H H H H H
charge: -0.166012 -0.170549 -0.170573 -0.210743 -0.685836 0.346567 -0.462913 0.350484 -0.391618 0.255519 0.172112 -0.309269 0.257801 0.269514 0.259564 0.319926 0.336028
chargesum: 0.00000
title: Mulliken charges with hydrogens summed into heavy atoms:
elementType: F F F F N C C C C C C C
charge: -0.166012 -0.170549 -0.170573 -0.210743 -0.029883 0.346567 -0.205112 0.350484 -0.122105 0.255519 0.172112 -0.049705
polarizability: 1.09801968e+02 7.44378974e+00 9.77100341e+01 -3.53317033e-03 7.92602073e-04 4.15966818e+01
1716.lowfreq: -10.8836 -3.0813 -0.0011 -0.0008 -0.0007 4.4427 19.3007 91.3294 155.9550
frequency: 9.5998 91.3239 155.9545 180.1832 258.7394 277.6744 293.1968 329.3637 362.6528 403.9270 430.8738 434.6318 475.6770 487.9387 516.8311 555.8700 585.0996 633.9821 667.7953 716.7100 746.3629 805.4511 859.1770 893.0149 927.2852 976.4940 1007.0309 1010.7998 1075.7613 1126.7758 1177.4059 1248.4797 1276.8126 1333.1073 1415.1573 1450.1374 1518.3649 1597.5720 1625.6358 1652.9046 3148.2709 3169.3816 3192.6596 3568.2437 3709.5516
redmass: 8.5503 11.9874 8.4891 5.3072 6.4614 5.4364 10.0179 12.3472 3.5668 1.3606 3.0457 6.0253 1.2846 4.6441 9.8999 5.4824 9.4054 5.8468 10.2678 3.5014 5.8409 1.3632 1.5862 6.8344 1.3443 10.6818 5.9725 2.1282 2.2501 1.6788 2.4662 2.4989 1.4420 2.9245 8.6588 4.5723 4.0240 6.7163 1.6253 2.6207 1.0923 1.0897 1.0967 1.0451 1.1045
irintensity: 0.5761 0.6901 2.3748 1.9614 3.1648 7.2715 1.0207 1.9760 33.8446 83.1465 16.6023 6.2752 191.8248 9.7417 9.0409 0.2537 20.3120 3.7360 2.1042 0.2241 8.7173 64.2874 53.4438 61.6536 5.0415 226.1271 194.0925 21.0719 59.8524 51.9887 100.5499 155.3828 4.5277 145.7821 7.0845 81.7998 112.4781 18.0535 8.7028 242.0017 3.0876 1.0356 0.7431 106.8185 39.5913
temp: 298.150 k
press: 1.00000 atm
elementType: 9 9 9 9 7 6 6 6 6 6 6 6 1 1 1 1 1
symmnumber: 1
zpe: 289375.8 jmol-1
zpe.correction: 0.110217 hartree
zpe.thermalcorrener: 0.120895 hartree
zpe.thermalcorrenthalpy: 0.121839 hartree
zpe.thermalcorrgfe: 0.072279 hartree
zpe.sumelectzpe: -723.004302 hartree
zpe.sumelectthermal: -722.993625 hartree
zpe.sumelectthermalent: -722.992680 hartree
zpe.sumelectthermalfe: -723.042241 hartree
dipole: -3.5397 -1.4110 0.0014
dipole: 3.8106
quadrupole: -73.4972 -54.6248 -71.7178
quadrupole: 7.6264 -0.0027 -0.0033
quadrupole: -6.8839 11.9885 -5.1045 7.6264 -0.0027 -0.0033
hfenergy: -723.1145192 hartree
pointgroup: C01 [X(C7H5F4N1)]
dipole: 1.3832874 0.5780091 0.0020237 debye
dipolederiv: -0.6301036 -0.2592104 -0.0003903 -0.2013867 -0.6242644 -0.0002448 -0.0003911 -0.0003394 -0.2861128 -0.6277532 0.1255463 0.1684059 0.2179351 -0.4193268 -0.2339139 0.196257 -0.2004249 -0.6419978 -0.6273277 0.1254433 -0.1685219 0.217682 -0.4196167 0.2342969 -0.1962326 0.2007276 -0.6421317 -1.0764645 0.14428 -0.0008153 0.1098659 -0.221609 0.0000636 -0.000809 0.0001094 -0.1383668 -0.7116848 -0.6654062 -0.0002271 -0.7277978 -0.9265219 -0.0004734 0.0000404 -0.0000888 -0.7274654 -0.4587952 0.1630338 -0.0001778 -0.0463266 0.1879975 0.0001131 -0.0002876 0.0003187 -0.1485483 -0.1417506 -0.4727257 -0.0001569 0.1183317 -0.0957115 0.000163 0.0000869 -0.0003292 -0.1732657 0.4863044 0.8436645 0.0005892 0.9888632 0.8505652 0.0010249 0.0006672 0.0009255 0.1370759 -0.1228449 0.0171308 0.0000704 -0.0659122 -0.1622717 -0.0000571 -0.0001119 -0.0000503 -0.1779499 2.1631184 -0.0409499 0.0006863 -0.2348359 1.3695308 -0.0001992 0.0006861 -0.000092 1.5577988 1.1142576 -0.0762201 0.0010095 -0.5265949 0.0066162 -0.0004673 0.0007086 -0.000106 0.0261247 0.0186896 -0.0287309 0.0001016 0.0076082 0.0436945 0.0000783 0.0001428 0.000035 -0.1075761 0.0789932 0.0285378 -0.0000698 0.0357342 -0.0345785 -0.0000608 -0.0000456 -0.0000723 0.1728345 0.0702433 -0.0544776 -0.0001216 -0.050295 0.0350805 -0.0001007 -0.0000855 -0.0000627 0.1766998 0.0691614 0.0567472 -0.000082 0.0633366 0.0021729 -0.0000178 -0.0000605 -0.0000261 0.1766032 0.1407436 0.0248636 -0.0001639 0.0663655 0.2330899 -0.000096 -0.0002742 -0.0003741 0.3943412 0.2552132 0.0684737 -0.0001362 0.0274269 0.1751528 -0.0001089 -0.000291 -0.0001502 0.4019364 unknown
polarizability: 109.5532728|7.6389928|97.9586545|0.066361|0.0310422|41.5967564 unknown
InChI: InChI=1S/C7H5F4N/c8-5-2-1-4(3-6(5)12)7(9,10)11/h1-3H,12H2
charge 0 multiplicity 1
17 atoms
F  -2.897044 -1.128032 -0.00279
F  -2.604004 0.820294 1.129456
F  -2.603041 0.820971 -1.132833
F  3.480607 -0.621708 0.002963
N  2.450496 1.926812 0.002865
C  -0.672558 -0.143477 -0.000595
C  0.160963 0.998844 0.000519
C  1.573195 0.854962 0.001761
C  -0.142215 -1.453113 -0.000827
C  -2.156288 0.075999 -0.001685
C  2.073667 -0.479708 0.001731
C  1.262213 -1.614454 0.000525
H  -0.277734 2.002558 0.000573
H  -0.803144 -2.32243 -0.00178
H  1.722964 -2.606381 0.000564
H  2.108208 2.882699 0.00355
H  3.453514 1.762864 0.003903
