program: Gaussian 09
title: 000136312
version: EM64L-G09RevD.01
frameworkgroup: C1[X(C3F4)]
method: RPBEPBE
basis: SDD
operation: Freq
keyword: #p
keyword: freq=noraman
keyword: PBEPBE/SDD
title: #p freq=noraman PBEPBE/SDD
converged: NO YES NO NO
title: Mulliken charges:
elementType: F F F F C C C
charge: -0.140125 -0.140738 -0.140240 -0.140212 0.359489 0.359567 -0.157741
chargesum: 0.00000
title: Mulliken charges with hydrogens summed into heavy atoms:
polarizability: 6.41757499e+01 -7.16523006e-03 2.15154120e+01 -1.57457597e-02 1.13951148e-03 2.14402539e+01
1716.lowfreq: -6.3271 -0.0010 0.0007 0.0010 3.1344 4.8651 101.4396 101.8910 138.2811
frequency: 101.4390 101.8903 138.2805 349.3114 499.0190 499.6226 505.0696 597.5940 597.8496 656.3089 930.9544 1089.7309 1091.1654 1485.4560 2096.7172
redmass: 15.5388 15.5346 18.9982 18.8649 13.8733 13.8617 17.0868 12.7523 12.7483 18.3232 14.7933 13.3479 13.3480 12.3422 12.0025
irintensity: 0.1817 0.1830 0.0000 0.0001 0.0826 0.0800 23.6596 26.2012 26.1958 0.0033 411.1052 277.5551 277.8492 0.0066 922.7508
temp: 298.150 k
press: 1.00000 atm
elementType: 9 9 9 9 6 6 6
symmnumber: 1
zpe: 64241.9 jmol-1
zpe.correction: 0.024468 hartree
zpe.thermalcorrener: 0.031019 hartree
zpe.thermalcorrenthalpy: 0.031963 hartree
zpe.thermalcorrgfe: -0.007275 hartree
zpe.sumelectzpe: -513.075375 hartree
zpe.sumelectthermal: -513.068824 hartree
zpe.sumelectthermalent: -513.067880 hartree
zpe.sumelectthermalfe: -513.107118 hartree
dipole: -0.0049 0.0023 0.0032
dipole: 0.0063
quadrupole: -41.1591 -37.1579 -37.1333
quadrupole: 0.0072 0.0068 -0.0005
quadrupole: -2.6757 1.3255 1.3501 0.0072 0.0068 -0.0005
hfenergy: -513.0998432 hartree
pointgroup: C01 [X(C3F4)]
dipole: -0.001925 0.0009035 0.001264 debye
dipolederiv: -0.8085392 -0.1950797 -0.1924771 -0.3612096 -0.388854 -0.2677792 -0.3561613 -0.2679305 -0.3814461 -0.8099421 0.1957048 0.1926666 0.3601687 -0.3882786 -0.2665279 0.355155 -0.2665971 -0.3808672 -0.8082431 0.1941333 -0.1937199 0.358846 -0.3847374 0.2675389 -0.358654 0.2681201 -0.3858824 -0.8102838 -0.1931461 0.1951401 -0.3564313 -0.3823088 0.2670045 0.3599018 0.2666313 -0.3862607 2.4276969 -0.000793 -0.0001296 0.0012347 1.0238555 0.6290424 0.0006515 0.6292736 1.0062336 2.4276991 -0.0017062 -0.0016225 -0.0038706 1.012408 -0.6291976 -0.0026408 -0.6294198 1.0182344 -1.6183879 0.0008869 0.0001425 0.0012621 -0.4920848 -0.0000812 0.0017478 -0.0000776 -0.4900116 unknown
polarizability: 64.1757092|-0.0400661|21.5154121|-0.0207597|0.0020245|21.4402945 unknown
InChI: InChI=1S/C3F4/c4-2(5)1-3(6)7
charge 0 multiplicity 1
7 atoms
F  2.119722 0.798859 0.78894
F  2.12323 -0.79999 -0.787586
F  -2.119501 0.794336 -0.795635
F  -2.12319 -0.789502 0.795483
C  1.312454 -0.001137 0.000218
C  -1.312675 0.000281 -0.000298
C  0.000059 -0.002947 -0.001122
