program: Gaussian 09
title: 000136280
version: EM64L-G09RevD.01
frameworkgroup: C1[X(C3F9P)]
method: RPBEPBE
basis: SDD
operation: Freq
keyword: #p
keyword: freq=noraman
keyword: PBEPBE/SDD
title: #p freq=noraman PBEPBE/SDD
converged: YES YES NO NO
title: Mulliken charges:
elementType: P F F F F F F F F F C C C
charge: 0.625878 -0.137737 -0.119995 -0.134296 -0.137838 -0.133926 -0.120438 -0.137781 -0.120656 -0.133687 0.183344 0.183516 0.183617
chargesum: 0.00000
title: Mulliken charges with hydrogens summed into heavy atoms:
polarizability: 6.67663079e+01 1.34961821e-02 6.67386208e+01 -1.48298597e-02 1.41556378e-02 5.37196415e+01
1716.lowfreq: -5.5314 -0.0006 0.0012 0.0013 6.1001 11.2353 32.9350 46.9901 49.0797
frequency: 32.9012 46.9735 48.9477 91.9437 94.2674 134.3028 205.7011 218.9386 222.0636 236.6706 250.8777 250.9371 389.1277 407.8642 408.2183 451.2797 454.1074 454.3386 485.7425 486.2748 502.6457 643.5123 647.9213 648.0492 974.6288 982.2046 982.7832 1005.0309 1005.7865 1044.8870 1045.6251 1046.9082 1067.8643
redmass: 18.9382 18.9314 18.9385 18.7321 18.7203 19.6056 17.9580 18.1195 18.1223 18.1912 18.1931 18.1938 22.4617 23.3579 23.3391 18.0032 18.1320 18.1367 19.1162 19.1166 19.9835 17.8277 17.9352 17.9327 13.4917 13.4322 13.4308 13.4055 13.4040 13.1815 13.1858 13.2247 13.2573
irintensity: 0.0609 0.0853 0.1030 0.9142 0.9565 2.7147 0.0115 1.9312 1.8333 0.5431 0.0231 0.0204 16.2589 14.1685 14.3256 0.1802 1.3604 1.3311 3.8664 3.8156 4.6162 1.3834 14.2664 14.3087 0.8328 261.4149 254.7659 190.9054 169.1836 230.2299 209.6440 72.6244 460.8531
temp: 298.150 k
press: 1.00000 atm
elementType: 15 9 9 9 9 9 9 9 9 9 6 6 6
symmnumber: 1
zpe: 101499.1 jmol-1
zpe.correction: 0.038659 hartree
zpe.thermalcorrener: 0.052413 hartree
zpe.thermalcorrenthalpy: 0.053357 hartree
zpe.thermalcorrgfe: -0.003572 hartree
zpe.sumelectzpe: -1353.074671 hartree
zpe.sumelectthermal: -1353.060917 hartree
zpe.sumelectthermalent: -1353.059973 hartree
zpe.sumelectthermalfe: -1353.116902 hartree
dipole: 0.0047 -0.0013 -1.3885
dipole: 1.3886
quadrupole: -81.8504 -81.8241 -78.3996
quadrupole: 0.0026 0.0021 -0.0085
quadrupole: -1.1590 -1.1328 2.2918 0.0026 0.0021 -0.0085
hfenergy: -1353.1133302 hartree
pointgroup: C01 [X(C3F9P1)]
dipole: 0.0015191 -0.0123825 -0.5461563 debye
dipolederiv: 0.1087986 0.0122293 -0.0004501 -0.013675 0.1079326 0.0073676 0.0002897 0.0072759 0.4615313 -0.4902355 -0.2269627 -0.034706 -0.2438781 -0.73814 0.0025598 -0.0128829 0.058865 -0.2487417 -0.2944006 0.0650777 -0.1611791 0.0546398 -0.3997659 0.0479932 -0.1752171 0.0878897 -0.8075861 -0.6624656 0.2568506 0.1921718 0.2874099 -0.4781406 -0.0820014 0.1360527 -0.0358079 -0.3374574 -0.4746179 0.2361372 0.006536 0.2184846 -0.753481 0.0518162 0.0452423 0.0050826 -0.2491966 -0.7544517 -0.2367988 -0.1652291 -0.2023588 -0.3902904 -0.1272795 -0.0981998 -0.1021302 -0.3330684 -0.4306326 0.0236147 0.1279448 0.014919 -0.2612881 0.0952804 0.1693135 0.0877253 -0.8110518 -0.8818066 0.0160573 0.0315054 -0.0025541 -0.3492028 -0.0288169 -0.0280888 -0.038317 -0.2469712 -0.3207677 -0.0746249 0.0287859 -0.0848742 -0.3828565 -0.1719848 0.0015016 -0.2039836 -0.7995431 -0.2899973 -0.0660918 -0.0255283 -0.0341263 -0.8429885 0.2208225 -0.0382128 0.1502466 -0.3443385 1.3353089 -0.1596713 0.004929 -0.1543678 1.6569437 0.0165483 0.0349366 -0.0516697 1.2389528 1.7135382 -0.0622238 0.0218157 -0.0605153 1.2783081 -0.0144691 -0.0517654 -0.006892 1.2393747 1.4417298 0.2164065 -0.026596 0.2208963 1.5529696 -0.0178361 0.0170306 0.0417153 1.2380958 unknown
polarizability: 66.7710808|0.004894|66.7288777|-0.0145443|-0.2546955|53.7246117 unknown
InChI: InChI=1S/C3F9P/c4-1(5,6)13(2(7,8)9)3(10,11)12
charge 0 multiplicity 1
13 atoms
P  0.000203 -0.022846 -1.04206
F  -0.389718 -2.591827 -0.133233
F  0.877579 -1.392119 1.319358
F  1.769334 -2.088555 -0.640326
F  -2.050492 1.624952 -0.230265
F  -2.679914 -0.514682 -0.665754
F  -1.666371 -0.013762 1.293692
F  2.437408 0.960508 -0.220404
F  0.800991 1.486215 1.262696
F  0.900618 2.55703 -0.728229
C  0.599078 -1.593574 -0.038396
C  -1.678031 0.275577 -0.077196
C  1.079414 1.313082 -0.099882
