program: Gaussian 09
title: 000136268
version: EM64L-G09RevD.01
frameworkgroup: C1[X(C2ClF4I)]
method: RPBEPBE
basis: SDD
operation: Freq
keyword: #p
keyword: freq=noraman
keyword: PBEPBE/SDD
title: #p freq=noraman PBEPBE/SDD
converged: NO NO NO NO
title: Mulliken charges:
elementType: I Cl F F F F C C
charge: 0.204832 0.100884 -0.123720 -0.121982 -0.112760 -0.106717 0.051680 0.107783
chargesum: 0.00000
title: Mulliken charges with hydrogens summed into heavy atoms:
polarizability: 6.51508304e+01 1.12641977e+01 5.05437303e+01 -7.25215509e+00 2.52715565e+00 3.55357623e+01
1716.lowfreq: -10.7621 -0.0016 -0.0014 0.0012 8.0368 12.3159 54.6349 112.7133 174.3078
frequency: 54.5939 112.7092 174.3076 233.7940 241.1998 276.9302 289.1256 339.7937 386.2276 422.6441 522.5815 579.5923 787.2442 911.6590 969.5439 1010.8972 1035.3439 1121.8990
redmass: 23.4066 30.2505 21.2282 23.5090 20.4772 20.0104 19.7033 18.3998 23.4451 19.0604 16.9965 17.6333 13.0468 13.1135 13.3722 13.1653 13.4942 12.4944
irintensity: 0.1453 0.4295 1.8157 1.2816 0.2187 1.1327 1.1708 2.3694 0.8683 4.3774 15.6816 15.4530 253.6741 292.3948 35.9073 81.1099 277.5477 114.2522
temp: 298.150 k
press: 1.00000 atm
elementType: 53 17 9 9 9 9 6 6
symmnumber: 1
zpe: 56643.7 jmol-1
zpe.correction: 0.021574 hartree
zpe.thermalcorrener: 0.030066 hartree
zpe.thermalcorrenthalpy: 0.031010 hartree
zpe.thermalcorrgfe: -0.014185 hartree
zpe.sumelectzpe: -946.489455 hartree
zpe.sumelectthermal: -946.480964 hartree
zpe.sumelectthermalent: -946.480019 hartree
zpe.sumelectthermalfe: -946.525214 hartree
dipole: -1.2930 -1.3237 -0.0198
dipole: 1.8505
quadrupole: -63.2831 -65.9692 -67.6722
quadrupole: 0.2356 -1.1296 0.4444
quadrupole: 2.3584 -0.3277 -2.0307 0.2356 -1.1296 0.4444
hfenergy: -946.5110296 hartree
pointgroup: C01 [X(C2Cl1F4I1)]
dipole: -0.2874008 -0.667681 0.0408515 debye
dipolederiv: -0.1453481 -0.2290921 0.1032859 -0.2179978 -0.2437207 0.1298064 0.0826469 0.1185553 -0.0025662 -0.2351985 0.1460074 0.139697 0.155062 -0.3711493 -0.2548919 0.1014817 -0.2143088 -0.2674856 -0.3833889 0.1222992 0.1127495 -0.0208125 -0.8896034 -0.2134538 -0.014844 -0.2421073 -0.3546469 -0.3303103 -0.0144867 -0.0301967 -0.0411985 -0.3685621 0.2004306 0.0983551 0.2728097 -0.8536368 -0.5653202 -0.3540763 0.1033871 -0.1735565 -0.7652405 0.0538798 0.0178205 0.0668726 -0.2775593 -0.3567043 -0.0002276 -0.085953 0.024935 -0.2642811 0.0504373 -0.0327437 -0.0347602 -0.8394046 0.8612392 0.0187441 -0.2107419 0.5845413 1.5897738 -0.2152187 -0.1985694 -0.2551466 1.2024325 1.1550312 0.310832 -0.132228 -0.3109731 1.3127833 0.2490102 -0.0541469 0.2880854 1.392867 unknown
polarizability: 51.0366297|13.2624234|59.9331146|-11.1666996|-2.7395727|40.2605788 unknown
InChI: InChI=1S/C2ClF4I/c3-1(4,5)2(6,7)8
charge 0 multiplicity 1
8 atoms
I  -2.03829 -1.426126 0.52925
Cl 1.453929 -1.429519 -0.890376
F  -1.084262 1.398111 0.561723
F  -0.9180 0.463098 -1.503719
F  1.512741 1.132258 -0.184886
F  1.007651 -0.312682 1.489721
C  -0.73088 0.216677 -0.128412
C  0.79721 -0.041717 0.126798
