program: Gaussian 09
title: 000136238
version: EM64L-G09RevD.01
frameworkgroup: C1[X(C13H9P)]
method: RPBEPBE
basis: SDD
operation: Freq
keyword: #pfreq=noraman
keyword: PBEPBE/SDD
title: #p freq=noraman PBEPBE/SDD
converged: NO NO NO NO
title: Mulliken charges:
elementType: P C C C C C C C C C C C C C H H H H H H H H H
charge: 0.590855 0.520431 0.519619 -0.462922 -0.460173 -0.498434 -0.390385 -0.391433 -0.292067 -0.293720 -0.243863 -0.243358 -0.233053 -0.232853 0.236755 0.232341 0.232720 0.241479 0.242194 0.231315 0.231237 0.231734 0.231579
chargesum: 0.00000
title: Mulliken charges with hydrogens summed into heavy atoms:
elementType: P C C C C C C C C C C C C C
charge: 0.590855 0.520431 0.519619 -0.462922 -0.460173 -0.261680 -0.158044 -0.158713 -0.050587 -0.051527 -0.012547 -0.012121 -0.001319 -0.001273
polarizability: 2.98395350e+02 -3.34847805e-02 1.70665318e+02 -6.99270698e-04 -2.84839708e-04 6.19510356e+01
1716.lowfreq: 0.0014 0.0017 0.0020 2.6420 10.4098 11.3921 81.9351 104.9257 205.4181
frequency: 81.9266 104.9250 205.4160 217.2169 224.9821 334.5761 347.5434 353.1624 422.4336 444.2531 467.7536 468.3389 491.5190 563.5410 590.9279 638.6537 670.1941 680.4795 745.5672 745.8208 759.0704 772.8089 847.6907 854.3037 871.3984 873.9943 923.0157 967.2515 972.6977 992.2854 993.0976 1012.6706 1019.7053 1040.5172 1081.5823 1111.6680 1151.2122 1172.0792 1177.0928 1208.5331 1252.6812 1252.9884 1274.6823 1380.5239 1405.3447 1407.0688 1423.3292 1436.0096 1467.4461 1484.2686 1543.5658 1565.1367 1602.6337 1617.4156 3098.5980 3114.8780 3117.0089 3118.6912 3121.8696 3140.8720 3140.9918 3160.2494 3160.9751
redmass: 5.2257 3.7736 5.5410 4.9740 4.7606 3.5915 7.2972 5.1134 12.7001 2.9930 2.8891 10.5085 3.4641 3.0783 6.8527 6.1661 6.4751 6.0807 2.5100 1.4198 2.5628 1.5007 5.9323 1.3102 1.4847 5.2964 1.5743 1.3674 1.4174 1.3383 1.3478 3.7079 2.7056 2.8925 4.3296 2.1362 1.6167 1.1249 1.0733 1.2854 1.6400 1.8363 2.1315 1.6076 3.4305 3.4536 3.1811 2.5301 2.4538 4.2624 7.2463 5.5074 5.5307 5.8661 1.0896 1.0866 1.0861 1.0888 1.0886 1.0943 1.0944 1.1004 1.1002
irintensity: 1.3684 0.0000 0.6405 2.1236 0.0003 1.4051 0.4487 0.1582 0.0412 22.4983 0.0001 1.6389 0.0002 1.7675 6.6978 0.1156 0.7122 1.5326 10.3107 120.2614 20.0767 0.0027 2.3799 7.3047 0.0027 0.1186 33.8050 0.0627 11.6712 0.0002 0.4786 11.0616 0.4433 3.4085 0.0191 0.0546 8.5647 0.1756 0.3112 1.1872 7.9837 18.4221 0.0009 0.5471 1.9778 2.0595 6.1657 16.2647 0.0905 2.7950 0.1920 1.0321 1.9905 4.4858 7.0754 4.6537 3.0937 1.4883 0.5155 0.8804 53.0900 67.4461 17.8576
temp: 298.150 k
press: 1.00000 atm
elementType: 15 6 6 6 6 6 6 6 6 6 6 6 6 6 1 1 1 1 1 1 1 1 1
symmnumber: 1
zpe: 459899.2 jmol-1
zpe.correction: 0.175166 hartree
zpe.thermalcorrener: 0.185372 hartree
zpe.thermalcorrenthalpy: 0.186316 hartree
zpe.thermalcorrgfe: 0.139267 hartree
zpe.sumelectzpe: -841.087503 hartree
zpe.sumelectthermal: -841.077297 hartree
zpe.sumelectthermalent: -841.076353 hartree
zpe.sumelectthermalfe: -841.123402 hartree
dipole: -0.0063 1.7713 0.0000
dipole: 1.7713
quadrupole: -71.0693 -80.4639 -95.2727
quadrupole: -0.0017 0.0000 0.0000
quadrupole: 11.1993 1.8047 -13.0041 -0.0017 0.0000 0.0000
hfenergy: -841.2626693 hartree
pointgroup: C01 [X(C13H9P1)]
dipole: -0.0004088 0.6968918 -0.0000153 debye
dipolederiv: -0.0280043 0.0020737 0.0000016 -0.0000494 0.2102257 0.0000015 0.0000003 -0.0000014 0.0354618 0.0313482 -0.0575459 -0.000002 -0.0801689 -0.1628552 -0.0000014 -0.000013 -0.0000029 0.1093016 0.0307954 0.0567976 -0.0000014 0.0804028 -0.1602082 0.0000003 -0.000002 -0.0000007 0.1077654 0.1766383 -0.1188709 -0.0000014 0.065726 -0.2305663 0.0000026 0.0000148 -0.0000015 -0.1198005 0.1776012 0.119779 -0.000001 -0.063896 -0.2316922 -0.0000007 0.0000015 0.0000011 -0.1185801 0.0053387 0.0005222 -0.0000009 -0.0013593 0.1579498 -0.000002 -0.0000062 0.0000031 -0.1721112 -0.0661285 0.0416817 0.0000012 -0.0666963 0.1124896 0.000001 0.000006 0.0000015 -0.1700168 -0.0669847 -0.041813 0.0000005 0.0644674 0.1131679 -0.0000029 0. -0.0000016 -0.1701086 -0.161331 0.0291083 0.0000012 0.1812953 0.1225798 0.000003 -0.0000005 0.0000001 -0.136056 -0.1602847 -0.0307924 -0.0000011 -0.1832873 0.1201007 -0.0000029 -0.0000017 -0.000006 -0.1364478 0.0126007 -0.1644329 -0.0000041 -0.0631589 0.0677617 0.0000055 -0.0000021 0.0000052 -0.1551159 0.012239 0.1634513 -0.000007 0.065534 0.069704 -0.0000034 -0.0000189 -0.0000068 -0.1550936 0.0273702 0.1551377 0.0000085 0.0096604 0.0633493 0.0000049 0.0000034 0.0000068 -0.1574166 0.0280615 -0.1554877 0.000005 -0.0099363 0.0606416 -0.0000023 0.0000189 -0.0000006 -0.1570014 0.060476 0.0003519 0.0000003 0.0009198 -0.0928494 0.0000008 0.0000028 -0.0000011 0.137012 0.0657282 -0.0624693 0.0000006 0.0412624 -0.1050627 -0.000003 0.0000037 -0.0000027 0.1568018 0.0651415 0.0619458 0.0000002 -0.0398833 -0.1049851 0.0000023 0.0000029 0.0000026 0.1571186 0.0911029 0.0381769 -0.0000011 -0.0664779 -0.0723938 -0.0000041 -0.0000049 -0.0000009 0.1490667 0.0903844 -0.0358679 0.0000004 0.0676946 -0.0710945 0.000003 -0.0000013 0.0000056 0.1494105 -0.082634 0.1064561 0.0000016 0.1152367 0.0174486 -0.0000028 -0.000002 -0.0000019 0.1610708 -0.0804165 -0.106988 0.0000043 -0.1171314 0.0151332 0.0000032 0.0000087 0.000004 0.1609564 -0.1136886 -0.0827392 -0.0000031 -0.0864743 0.0501163 -0.0000042 -0.0000038 -0.000004 0.1619707 -0.1153538 0.0815253 -0.0000021 0.0863199 0.0510393 0.0000014 -0.0000068 0.0000016 0.1618123 unknown
polarizability: 298.3928975|0.560664|170.6677706|-0.0007004|0.000282|61.9510356 unknown
InChI: InChI=1S/C13H9P/c1-3-7-12-10(5-1)9-11-6-2-4-8-13(11)14-12/h1-9H
charge 0 multiplicity 1
23 atoms
P  0.000735 -1.942005 0.000049
C  -1.270506 0.650429 0.000049
C  1.258044 0.661536 0.000041
C  -1.39416 -0.800198 0.000067
C  1.394833 -0.788779 0.000049
C  -0.00972 1.301292 0.00004
C  -2.478196 1.446773 0.000067
C  2.458561 1.466913 0.000023
C  -2.714499 -1.37351 0.000021
C  2.717223 -1.353183 0.000039
C  -3.736728 0.855887 0.000066
C  3.721995 0.884569 0.00002
C  -3.858035 -0.57558 0.000033
C  3.854304 -0.544176 0.000029
H  -0.012724 2.400726 0.000034
H  -2.375582 2.539258 0.000078
H  2.352646 2.558872 0.000013
H  -2.808427 -2.466913 -0.000002
H  2.822087 -2.44504 0.000055
H  -4.64033 1.475561 0.000076
H  4.619037 1.513846 -0.000003
H  -4.852141 -1.036016 0.000014
H  4.851083 -0.999161 0.000042
