program: Gaussian 09
title: 000136232
version: EM64L-G09RevD.01
frameworkgroup: C1[X(C9H6S2)]
method: RPBEPBE
basis: SDD
operation: Freq
keyword: #p
keyword: freq=noraman
keyword: PBEPBE/SDD
title: #p freq=noraman PBEPBE/SDD
converged: NO YES NO NO
title: Mulliken charges:
elementType: S S C C C C C C C C C H H H H H H
charge: 0.282505 0.282511 -0.628468 0.462386 0.462384 -0.384652 -0.384660 -0.294200 -0.294201 -0.520004 -0.520002 0.250657 0.250660 0.255006 0.255007 0.262536 0.262535
chargesum: 0.00000
title: Mulliken charges with hydrogens summed into heavy atoms:
elementType: S S C C C C C C C C C
charge: 0.282505 0.282511 -0.127151 0.462386 0.462384 -0.384652 -0.384660 -0.039193 -0.039194 -0.257468 -0.257467
polarizability: 2.01760407e+02 -3.66035002e-05 1.30898648e+02 -4.41862062e-03 4.44662709e-03 5.07545608e+01
1716.lowfreq: -6.2985 0.0025 0.0027 0.0029 9.0933 11.7862 117.2771 142.1747 192.2601
frequency: 117.2723 142.1747 192.2601 255.0283 263.2638 406.5448 439.0062 449.5673 469.8938 558.1164 570.7889 572.1837 627.8765 630.6404 670.1754 686.5767 706.5668 752.8865 787.0419 867.2965 879.7992 905.0696 931.8256 977.4856 978.2474 1093.3103 1096.2369 1116.1773 1166.1807 1214.0119 1238.7418 1340.4628 1385.2123 1403.5900 1419.0434 1447.3083 1459.2214 1494.4765 1502.5386 2989.7772 3035.2364 3172.3101 3172.5594 3237.8958 3238.0821
redmass: 4.7874 8.5500 10.5564 2.0983 6.6554 11.2246 6.1077 4.6677 3.9587 5.0383 3.0566 11.2119 2.3287 6.5955 7.9492 1.1989 1.6683 5.6436 4.9372 1.3536 1.2934 6.7679 2.1651 4.3414 3.8307 1.1902 1.1997 1.1289 1.2882 1.5993 1.5658 4.9948 5.7058 6.5147 1.2992 7.7734 5.3351 5.2857 5.8629 1.0608 1.0993 1.0923 1.0926 1.0989 1.0989
irintensity: 2.9589 0.0000 1.1613 12.3708 0.0000 2.4980 0.2185 2.9205 0.0000 0.6305 23.1431 1.3939 0.0000 0.9168 8.1327 149.1903 0.0000 24.5819 11.1890 4.6951 0.0000 5.3566 11.7951 26.9281 10.7429 2.2870 27.9108 0.0000 10.7389 0.6467 3.3549 4.7477 0.0200 9.3209 30.2616 1.3516 1.7616 10.1220 4.7946 13.0815 7.1499 12.6026 2.6899 0.3724 0.8459
temp: 298.150 k
press: 1.00000 atm
elementType: 16 16 6 6 6 6 6 6 6 6 6 1 1 1 1 1 1
symmnumber: 1
zpe: 311387.7 jmol-1
zpe.correction: 0.118601 hartree
zpe.thermalcorrener: 0.127234 hartree
zpe.thermalcorrenthalpy: 0.128178 hartree
zpe.thermalcorrgfe: 0.084521 hartree
zpe.sumelectzpe: -1141.888305 hartree
zpe.sumelectthermal: -1141.879672 hartree
zpe.sumelectthermalent: -1141.878728 hartree
zpe.sumelectthermalfe: -1141.922386 hartree
dipole: 0.0000 2.2474 0.0003
dipole: 2.2474
quadrupole: -66.5870 -71.9125 -83.1008
quadrupole: 0.0001 -0.0002 0.0008
quadrupole: 7.2798 1.9543 -9.2341 0.0001 -0.0002 0.0008
hfenergy: -1142.0069064 hartree
pointgroup: C01 [X(C9H6S2)]
dipole: -0.0000089 -0.8841977 -0.0001331 debye
dipolederiv: 0.0354911 0.0532492 0.000003 -0.0521952 -0.2638299 -0.0000355 0.0000301 0.0000021 0.1513202 0.035492 -0.0532531 -0.0000075 0.0521812 -0.2638266 -0.0000082 0.0000228 -0.0000369 0.1513224 -0.0035002 -0.0000021 0.0000196 -0.0000026 -0.1363493 -0.0000244 0.0000286 -0.0000334 0.1947176 -0.177717 0.1518126 0.0000034 0.1340659 -0.0135924 -0.0000179 0.0001283 -0.0000552 -0.05408 -0.1777276 -0.1518122 -0.000034 -0.134067 -0.0135914 0.0000361 0.0000784 0.0000748 -0.0540792 0.3153742 0.3336398 0.0000099 0.407749 0.1125619 0.000036 -0.0000005 0.000074 -0.1248134 0.315361 -0.3336407 -0.0000221 -0.4077418 0.1125692 -0.0000208 -0.0000656 -0.0000593 -0.1248151 0.1358362 -0.1503408 0.0000187 -0.103175 -0.1625408 0.0000446 -0.0000348 0.0000354 -0.1391865 0.1358462 0.1503332 0.0000383 0.1031611 -0.162542 -0.0000256 -0.0000261 -0.0000015 -0.1391858 -0.4146131 -0.1998339 -0.0000145 -0.1068 0.3314666 0.0000366 -0.0001935 0.0000085 -0.3513828 -0.414608 0.1998475 0.0000294 0.1068227 0.3314566 0.0000191 -0.000107 0.0000415 -0.3513849 0.0638384 -0.0000143 -0.0000123 -0.0000124 0.0168561 -0.0885684 -0.0000111 -0.1228851 0.0044718 0.0638434 0.0000142 -0.0000112 0.000012 0.0168179 0.0885715 -0.0000096 0.1228891 0.0045098 0.0520697 0.0440357 0.0000006 0.1090334 -0.028504 -0.0000356 0.0000204 -0.0000397 0.1886045 0.0520685 -0.0440362 -0.0000047 -0.1090339 -0.0285004 0.0000016 -0.0000103 -0.0000107 0.1886046 -0.0085278 -0.0114524 -0.0000028 0.0021168 0.0757748 -0.0000132 0.0000917 -0.0000033 0.2276879 -0.0085268 0.0114536 -0.0000139 -0.0021142 0.075774 0.0000042 0.0000581 -0.0000003 0.2276889 unknown
polarizability: 201.7604071|-0.0004389|130.8986479|0.0044187|0.0044466|50.7545608 unknown
InChI: InChI=1S/C9H6S2/c1-3-10-8-6(1)5-7-2-4-11-9(7)8/h1-4H,5H2
charge 0 multiplicity 1
17 atoms
S  2.054117 1.731782 0.000283
S  -2.054037 1.731811 0.000211
C  0.000006 -1.739984 0.000013
C  1.187705 -0.783145 0.000003
C  -1.187676 -0.783126 0.000203
C  0.721181 0.54348 0.000145
C  -0.721136 0.543492 0.00024
C  2.61724 -0.880048 0.000015
C  -2.617212 -0.880009 0.00024
C  3.242234 0.363315 0.000302
C  -3.242188 0.363367 0.000054
H  -0.000094 -2.400515 -0.889115
H  0.000099 -2.400674 0.889009
H  3.179369 -1.817261 -0.000143
H  -3.179356 -1.817212 0.00024
H  4.305414 0.597024 0.000323
H  -4.305364 0.597105 -0.000023
