program: Gaussian 09
title: 000136221
version: EM64L-G09RevD.01
frameworkgroup: C1[X(C4H4Br2ClF3)]
method: RPBEPBE
basis: SDD
operation: Freq
keyword: #p
keyword: freq=noraman
keyword: PBEPBE/SDD
title: #p freq=noraman PBEPBE/SDD
converged: YES YES NO NO
title: Mulliken charges:
elementType: Br Br Cl F F F C C C C H H H H
charge: 0.091246 0.009327 0.046867 -0.146921 -0.129435 -0.108385 -0.002937 -0.333535 0.080166 -0.670295 0.278265 0.278399 0.309020 0.298218
chargesum: 0.00000
title: Mulliken charges with hydrogens summed into heavy atoms:
elementType: Br Br Cl F F F C C C C
charge: 0.091246 0.009327 0.046867 -0.146921 -0.129435 -0.108385 -0.002937 0.223129 0.080166 -0.063057
polarizability: 9.29544754e+01 6.92616888e+00 7.95420169e+01 -7.31854140e+00 2.99641507e+00 6.95615715e+01
1716.lowfreq: -4.7526 -0.0024 -0.0019 -0.0011 7.4178 11.1026 39.8667 63.4205 78.3656
frequency: 39.8198 63.4076 78.3630 84.6478 139.7564 160.8237 211.8492 260.0120 263.0306 286.1268 304.7368 342.8548 363.9388 416.4321 523.3425 573.3091 661.2764 757.0076 796.9265 853.4361 923.3880 996.8508 1001.4251 1065.7819 1089.7501 1140.6019 1166.9078 1247.7169 1293.9308 1349.6847 1445.3811 1457.8581 3026.6962 3076.6325 3096.7959 3164.8585
redmass: 14.4588 9.1772 6.8958 2.9131 17.7502 18.2210 9.5635 18.1255 9.4528 7.3502 15.7047 9.9693 6.2296 11.1818 12.6447 7.7544 4.2727 2.2121 2.2958 3.6466 10.1924 2.8222 2.3930 5.6491 8.1896 4.6974 1.3249 1.2038 1.1279 1.4156 1.0775 1.0968 1.0615 1.0563 1.1007 1.1114
irintensity: 0.8981 1.6951 0.9068 0.4770 0.2534 1.2077 3.4214 0.0829 4.2154 4.8217 0.4946 2.5922 3.5405 2.6522 25.0010 40.1610 15.8672 43.4671 90.7359 168.7342 116.3729 109.0556 24.8390 9.6717 135.9878 17.6037 30.5608 18.4661 2.9097 36.3771 7.3228 10.8397 3.6927 5.6258 0.5402 1.3338
temp: 298.150 k
press: 1.00000 atm
elementType: 35 35 17 9 9 9 6 6 6 6 1 1 1 1
symmnumber: 1
zpe: 201722.4 jmol-1
zpe.correction: 0.076832 hartree
zpe.thermalcorrener: 0.088512 hartree
zpe.thermalcorrenthalpy: 0.089456 hartree
zpe.thermalcorrgfe: 0.035766 hartree
zpe.sumelectzpe: -940.527476 hartree
zpe.sumelectthermal: -940.515796 hartree
zpe.sumelectthermalent: -940.514852 hartree
zpe.sumelectthermalfe: -940.568542 hartree
dipole: -0.4430 -0.8078 -1.0056
dipole: 1.3638
quadrupole: -91.5218 -83.8389 -84.2411
quadrupole: -4.7426 -2.0451 -0.2218
quadrupole: -4.9879 2.6950 2.2929 -4.7426 -2.0451 -0.2218
hfenergy: -940.6043082 hartree
pointgroup: C01 [X(C4H4Br2Cl1F3)]
dipole: -0.2347187 -0.2245735 -0.427059 debye
dipolederiv: -0.1219695 0.089747 0.0759299 0.0921541 -0.3163538 -0.2826732 0.0738637 -0.2754633 -0.3279045 -0.4289166 -0.0709854 0.0368303 -0.1675422 -0.1840103 0.0187488 0.0150827 0.0039128 -0.109744 -0.1924464 -0.0053682 0.0299418 -0.0326279 -0.2898135 0.2362109 0.0426667 0.2187521 -0.4367537 -0.3973813 0.0622925 0.0683784 0.0325659 -0.4759513 -0.3160523 0.0237329 -0.1570151 -0.6485399 -0.3697367 0.0921686 -0.0306153 0.0119809 -0.3878129 0.2401058 0.0757776 0.1301749 -0.8514994 -0.6981889 -0.3332838 -0.0951668 -0.2025984 -0.6019744 -0.1309791 -0.0850512 -0.1018296 -0.2896476 0.5795703 -0.0511143 -0.2351602 0.2146153 0.7918627 0.0148425 0.0246148 -0.3405811 1.0786533 -0.240399 -0.0036945 -0.0242206 -0.1419734 -0.207725 0.0202338 0.0601508 0.0811671 -0.0656434 1.0563266 0.1725449 0.2040148 -0.0643632 1.306891 0.2100344 -0.2026144 0.4554256 1.4556702 0.595219 0.2518933 -0.052589 0.2435506 0.2491808 -0.0172528 -0.019816 -0.0162355 0.1084504 0.0861484 -0.0426489 -0.0091972 0.0225096 0.0523827 0.0639087 -0.0356508 0.057955 0.0308945 0.1136405 -0.0035077 0.023825 0.0390196 0.0544184 -0.0581959 0.0219296 -0.0683486 0.0205384 0.0056988 -0.0816886 -0.0252753 -0.0232058 -0.0005706 -0.063448 0.0304577 -0.0604463 0.0276763 0.0124347 -0.0763548 0.0333043 -0.0240851 0.0094763 0.0645162 -0.0251441 0.0725321 0.0078495 unknown
polarizability: 91.3695261|8.6665696|77.6306321|-8.2514739|3.7779955|73.0579056 unknown
InChI: InChI=1S/C4H4Br2ClF3/c5-2-1-3(7,8)4(6,9)10/h1-2H2
charge 0 multiplicity 1
14 atoms
Br 1.825299 -1.656402 -1.288398
Br -4.011778 -0.87119 0.076354
Cl 0.19974 1.485316 -1.588359
F  0.044457 1.373709 1.07771
F  1.410472 -1.002976 1.39309
F  2.537104 0.581298 0.226588
C  0.109308 0.450183 -0.028389
C  -1.135935 -0.438569 -0.013398
C  1.460873 -0.316537 0.151986
C  -2.432169 0.385252 -0.01544
H  -1.092345 -1.061514 0.899143
H  -1.112028 -1.114948 -0.883932
H  -2.519062 1.034916 0.866168
H  -2.568736 0.961563 -0.941124
