program: Gaussian 09
title: 000136197
version: EM64L-G09RevD.01
frameworkgroup: C1[X(C7H7F3N2)]
method: RPBEPBE
basis: SDD
operation: Freq
keyword: #pfreq=noraman
keyword: PBEPBE/SDD
title: #p freq=noraman PBEPBE/SDD
converged: NO NO NO NO
title: Mulliken charges:
elementType: F F F N N C C C C C C C H H H H H H H
charge: -0.165568 -0.183691 -0.183550 -0.690741 -0.712139 0.190538 0.369713 -0.569176 0.554351 -0.375838 0.236730 -0.414271 0.252072 0.217396 0.219134 0.337863 0.306482 0.303820 0.306875
chargesum: 0.00000
title: Mulliken charges with hydrogens summed into heavy atoms:
elementType: F F F N N C C C C C C C
charge: -0.165568 -0.183691 -0.183550 -0.046397 -0.101443 0.190538 0.369713 -0.317104 0.554351 -0.158442 0.236730 -0.195137
polarizability: 1.24482818e+02 1.30330382e+01 1.11206470e+02 -4.05096386e-03 6.74782404e-03 4.53117825e+01
1716.lowfreq: -14.1905 -4.4070 0.0007 0.0010 0.0010 6.8783 9.6251 105.4985 141.3797
frequency: -12.4549 105.4982 141.3785 172.1849 270.1809 276.2401 280.6864 317.5834 320.9440 331.3865 340.2852 358.8460 362.7801 420.1167 443.6365 469.9544 499.1060 529.4040 603.8620 616.5957 693.3727 717.4322 790.5584 810.1195 868.1024 873.1655 929.7333 943.9172 997.2626 1002.0056 1029.4477 1066.3448 1165.9601 1237.4399 1277.4414 1318.3690 1338.9457 1405.2858 1457.0973 1525.9867 1580.0593 1638.4573 1655.3774 1670.6643 3117.0082 3141.1847 3156.0189 3568.7477 3575.9226 3707.1008 3715.6242
redmass: 8.3295 4.3050 4.8438 7.2138 5.3143 2.7509 1.1126 1.0845 9.0938 1.4771 1.4114 3.5580 4.0769 4.8877 5.1186 6.6143 4.2379 5.4329 4.0883 10.9376 7.8000 4.0118 5.1407 1.5454 1.5380 6.6746 1.4131 7.7005 2.5238 5.2150 1.7597 1.5954 1.1803 2.8895 1.9148 1.5166 6.4539 7.6940 4.0459 3.7669 6.9868 1.1715 1.2922 3.7816 1.0867 1.0966 1.0913 1.0452 1.0451 1.1042 1.1041
irintensity: 1.5968 0.2934 10.7957 0.9301 13.9270 4.9632 171.2834 73.2185 1.3502 93.1902 233.1514 6.2956 1.5486 2.1891 0.2574 0.3996 7.3087 0.0241 14.3795 12.9414 3.7596 0.5385 41.9422 50.9823 72.9190 73.5593 11.8794 235.3717 96.2169 89.6581 13.1283 25.2384 1.9885 292.0691 38.6301 75.2706 49.7894 20.0900 73.6437 409.6066 18.4256 118.7214 180.8137 3.9625 18.3393 22.3414 6.5181 111.9499 45.8005 31.3177 21.1884
temp: 298.150 k
press: 1.00000 atm
elementType: 9 9 9 7 7 6 6 6 6 6 6 6 1 1 1 1 1 1 1
symmnumber: 1
zpe: 351910.4 jmol-1
zpe.correction: 0.134036 hartree
zpe.thermalcorrener: 0.144823 hartree
zpe.thermalcorrenthalpy: 0.145768 hartree
zpe.thermalcorrgfe: 0.098509 hartree
zpe.sumelectzpe: -679.108302 hartree
zpe.sumelectthermal: -679.097514 hartree
zpe.sumelectthermalent: -679.096570 hartree
zpe.sumelectthermalfe: -679.143828 hartree
dipole: -4.0506 1.7136 -0.0016
dipole: 4.3982
quadrupole: -58.6398 -54.3661 -75.6296
quadrupole: 8.4643 -0.0108 -0.0041
quadrupole: 4.2387 8.5124 -12.7511 8.4643 -0.0108 -0.0041
hfenergy: -679.2423375 hartree
pointgroup: C01 [X(C7H7F3N2)]
dipole: -1.6245168 -0.5959197 0.0025446 debye
dipolederiv: -0.4355366 -0.162529 0.0002082 -0.138883 -0.806237 -0.0000806 0.0004186 0.0002201 -0.2762163 -0.7682671 -0.0819964 -0.2669252 0.0659563 -0.2925814 0.1311871 -0.2934505 0.0427271 -0.6410789 -0.7671598 -0.0825588 0.2674052 0.0655455 -0.2923149 -0.1313261 0.2944082 -0.0421307 -0.6426643 -0.8066295 0.803981 -0.000365 0.6655739 -0.8481498 -0.0001888 0.0001638 -0.0009186 -0.7022144 -0.9442635 0.73745 -0.0004813 0.7999265 -0.7050215 -0.0007088 -0.0003399 -0.0008366 -0.7774193 -0.5907349 -0.4955573 0.0007444 0.2113774 -0.1488441 -0.000153 -0.000257 -0.0000079 -0.2152693 0.640783 -0.9688158 0.0005734 -0.6867731 0.635309 -0.00017 0.0003596 0.0000798 0.1242178 0.0210035 0.6295718 -0.0007372 -0.2965564 -0.0655842 0.0000948 0.000316 -0.0004417 -0.1852363 0.766527 -1.0521536 0.0005274 -0.995675 0.4006131 0.0004751 0.0005111 0.0005302 0.1191964 -0.0766972 0.5530235 -0.0006258 -0.1298149 0.0464439 -0.0001658 0.0000064 -0.0003602 -0.1872304 2.1736563 0.5398668 -0.0011115 0.2014669 1.3852519 0.0000447 -0.0016949 -0.0009937 1.5333288 0.0339842 -0.1548787 0.0000322 0.4743644 0.1206376 -0.0006116 -0.0006195 -0.0002619 -0.1847354 0.1063143 -0.003524 0.0000421 0.001051 -0.0523281 0.0002288 0.0000144 0.000197 0.1697262 0.069205 -0.007894 0.0000707 -0.0365658 -0.1318882 0.0003341 0.000068 0.0003312 0.1624793 -0.1299259 -0.0516441 0.0002227 -0.0358983 0.0761656 0.0000999 0.0002254 0.0000871 0.1602432 0.2310389 -0.0666228 -0.0000095 -0.0110396 0.1687252 0.0001408 -0.0002932 0.0006353 0.3699084 0.1476497 -0.0457556 0.0000865 -0.0594638 0.1994512 0.0002291 0.0000454 0.0003963 0.3814394 0.1891108 -0.0476603 0.0001337 -0.0352784 0.131894 0.0002739 -0.0000029 0.0003444 0.3960795 0.1399418 -0.0423026 0.0002089 -0.0593135 0.1784577 0.0002965 0.0001212 0.0004028 0.3954459 unknown
polarizability: 123.1856714|-13.6161541|112.5035312|-0.0392599|-0.0588527|45.3118679 unknown
InChI: InChI=1S/C7H7F3N2/c8-7(9,10)5-3-4(11)1-2-6(5)12/h1-3H,11-12H2
charge 0 multiplicity 1
19 atoms
F  1.836165 1.973451 -0.002169
F  2.469542 0.105739 1.124722
F  2.466534 0.106272 -1.131351
N  1.022951 -2.286138 0.001665
N  -3.145717 1.584911 0.000498
C  0.295972 0.089029 -0.000246
C  0.021763 -1.316139 0.001335
C  -0.751642 1.043393 -0.000593
C  -2.108269 0.643379 0.000683
C  -1.350514 -1.701743 0.002511
C  1.70596 0.567903 -0.002197
C  -2.385796 -0.755777 0.002158
H  -0.494916 2.107505 -0.001827
H  -1.598944 -2.769999 0.003723
H  -3.427018 -1.101186 0.003112
H  2.008943 -2.042234 0.001981
H  0.772829 -3.270042 0.002863
H  -4.116448 1.289324 0.001183
H  -2.946295 2.580052 -0.000853
