program: Gaussian 09
title: 000136184
version: EM64L-G09RevD.01
frameworkgroup: C1[X(C6H11ClF3N)]
method: RPBEPBE
basis: SDD
operation: Freq
keyword: #p
keyword: freq=noraman
keyword: PBEPBE/SDD
title: #p freq=noraman PBEPBE/SDD
converged: NO YES NO NO
title: Mulliken charges:
elementType: Cl F F F N C C C C C C H H H H H H H H H H H
charge: 0.004556 -0.228800 -0.170816 -0.134472 -0.112134 0.375340 -0.369585 -0.325722 -0.294904 -0.655691 -0.657797 0.217711 0.234702 0.212018 0.255589 0.284184 0.221984 0.238634 0.219172 0.248707 0.224868 0.212455
chargesum: 0.00000
title: Mulliken charges with hydrogens summed into heavy atoms:
elementType: Cl F F F N C C C C C C
charge: 0.004556 -0.228800 -0.170816 -0.134472 -0.112134 0.375340 0.082828 0.141885 -0.010720 0.024100 0.028232
polarizability: 8.64576945e+01 -3.97310889e+00 8.57971421e+01 -2.06964855e+00 3.39057496e+00 7.54438736e+01
1716.lowfreq: -17.4964 -9.1377 -4.2504 -0.0015 -0.0009 0.0014 38.4372 55.4683 73.4813
frequency: 38.2283 55.2673 73.4146 99.8508 124.8185 161.5592 186.7165 217.1124 244.9662 271.8516 293.5722 307.9032 319.0592 357.6276 362.4481 414.4500 484.1943 515.3722 609.3744 700.6083 735.8041 771.8330 782.8607 792.0985 870.8729 931.2779 1007.9039 1029.5711 1076.9190 1088.2477 1104.3233 1113.4894 1146.0342 1212.1127 1227.8030 1276.3171 1292.0353 1318.4334 1349.2742 1368.8155 1387.5324 1393.0266 1431.5814 1463.0750 1467.0324 1474.3964 1484.3685 1489.5242 1495.5008 2959.2711 2991.2069 2992.0222 3000.9787 3058.2718 3065.1736 3086.4719 3089.7738 3103.3868 3111.5465 3119.3718
redmass: 4.4363 4.4139 6.0192 2.7128 2.8808 4.4417 1.3862 2.3234 1.4404 10.0837 4.8675 2.7437 4.9923 5.1113 2.9614 7.1438 6.2312 5.3492 3.9430 6.3734 4.9760 1.2027 1.2842 6.9014 2.8634 2.0703 6.2683 2.4036 2.3091 1.9290 3.7314 1.7344 2.2369 1.2206 2.8655 1.4372 1.2833 1.2553 1.2396 1.2931 1.2179 1.2175 2.5143 1.0538 1.0529 1.0741 1.0561 1.0731 1.1084 1.0695 1.0370 1.0363 1.0609 1.1023 1.0928 1.0982 1.0976 1.1015 1.1013 1.0880
irintensity: 0.6642 0.2498 0.6839 0.6522 2.4347 1.4764 3.6319 2.7707 0.1905 2.2395 1.1957 2.3655 10.4865 0.9178 2.3421 2.1375 2.6807 12.5174 25.4109 69.4363 76.6756 19.3697 17.7123 163.4791 35.6938 5.8436 78.9804 20.3091 12.4257 25.7233 112.5555 20.4580 7.6740 18.6220 82.9939 50.0525 34.2018 4.2885 9.0228 4.9141 14.7924 28.7405 175.2921 1.4998 4.3685 1.1219 11.6707 15.6262 32.4622 45.1819 14.1573 29.4897 28.9252 4.3286 10.8192 71.5544 13.8013 30.9992 27.2806 9.4419
temp: 298.150 k
press: 1.00000 atm
elementType: 17 9 9 9 7 6 6 6 6 6 6 1 1 1 1 1 1 1 1 1 1 1
symmnumber: 1
zpe: 442605.9 jmol-1
zpe.correction: 0.168580 hartree
zpe.thermalcorrener: 0.181730 hartree
zpe.thermalcorrenthalpy: 0.182674 hartree
zpe.thermalcorrgfe: 0.128253 hartree
zpe.sumelectzpe: -1048.661117 hartree
zpe.sumelectthermal: -1048.647967 hartree
zpe.sumelectthermalent: -1048.647023 hartree
zpe.sumelectthermalfe: -1048.701444 hartree
dipole: -3.8565 2.7125 -1.6484
dipole: 4.9948
quadrupole: -71.1920 -75.3643 -71.9531
quadrupole: 3.4373 -1.2094 -4.3258
quadrupole: 1.6444 -2.5278 0.8834 3.4373 -1.2094 -4.3258
hfenergy: -1048.8296971 hartree
pointgroup: C01 [X(C6H11Cl1F3N1)]
dipole: -1.7621836 -0.8695809 -0.0138763 debye
dipolederiv: -0.2249774 -0.00069 -0.0275395 -0.0100136 -0.2132273 -0.1564148 -0.0536455 -0.2062721 -0.5403652 -0.5817907 0.026491 -0.0803696 -0.0943114 -0.3955846 -0.1860875 -0.515158 -0.1000599 -0.9530772 -0.454499 -0.1103469 0.055722 -0.2260067 -0.6497361 0.1532778 0.0138677 0.1384558 -0.352319 -0.7609253 -0.1434149 -0.2313102 -0.1476914 -0.3018952 -0.1209603 -0.0351549 -0.0648746 -0.290103 -1.1875417 -0.0603362 -0.219848 -0.050234 -0.7117701 0.0179234 -0.1250278 -0.0390226 -0.5597482 1.6870249 0.120154 0.1305135 0.3749725 0.8839303 0.0885565 0.6160792 -0.0644835 1.2349401 0.3218693 0.2433561 -0.0642271 0.3142938 0.5238028 -0.0071524 -0.0462439 0.0201925 0.2932498 0.3729732 -0.2269619 0.0456181 -0.3022715 0.4395339 -0.0680122 0.0288428 -0.0785689 0.2716701 0.8965675 0.2193984 0.3139067 0.1305411 0.5192019 0.2757387 0.0024644 0.2975869 0.9461593 -0.0281775 -0.0864213 -0.0529766 -0.0603106 0.028083 -0.0339068 -0.0683279 -0.0435861 -0.0419847 0.0104475 0.0263863 -0.0107972 0.0423445 0.005665 0.0618779 -0.0241973 0.1040626 -0.0728625 -0.0794693 0.1122719 -0.038069 0.0927667 -0.0483568 -0.0000689 -0.0242561 -0.0061467 0.0768576 -0.0282983 -0.091815 0.0844493 -0.0532948 0.010318 -0.0369499 0.0974092 0.0457294 -0.1413555 -0.1067994 -0.0183202 0.0819212 -0.054795 0.0131387 0.0966347 0.0687609 0.0760989 0.0151463 0.0561006 -0.0419453 -0.0981625 0.0199061 -0.0382343 -0.0526232 -0.0469124 -0.0541272 -0.0092634 0.0443147 -0.0154411 0.0106281 -0.0251234 -0.0338055 -0.0043334 0.045116 0.0285955 -0.047442 -0.0492999 0.1226125 -0.0186257 0.1513999 0.0036047 0.0067129 0.0007647 -0.0244802 0.0694841 0.0619702 0.0044173 0.0972726 0.0013619 0.1109562 0.0274567 0.0537188 -0.0009185 -0.0815261 0.0494038 -0.0824007 -0.0082481 -0.1146985 -0.1399644 0.0217421 0.0027465 0.0522938 0.0859554 -0.0286002 -0.0907434 0.0871425 -0.0549378 0.0752677 0.0343672 0.0505884 0.0259556 0.0445796 0.0533928 -0.0598759 -0.0631671 -0.0859385 -0.0084448 -0.1142844 -0.0572394 -0.0827421 -0.0194251 -0.0236856 0.1536253 0.0061667 0.1520406 -0.0724832 -0.003494 0.0158046 -0.0236888 0.0714296 unknown
polarizability: 87.0178433|0.6295874|79.4074628|5.205274|5.1474139|81.2734041 unknown
InChI: InChI=1S/C6H11ClF3N/c1-3-11(4-2)6(9,10)5(7)8/h5H,3-4H2,1-2H3
charge 0 multiplicity 1
22 atoms
Cl 1.468942 -1.41422 -1.553016
F  0.871939 0.473968 2.054935
F  1.002758 1.50631 0.013407
F  2.938049 -0.29437 0.384182
N  -0.745444 0.013875 0.304482
C  0.591639 0.252103 0.571013
C  -1.330612 -1.341403 0.477173
C  -1.675992 1.177918 0.423347
C  1.638828 -0.835389 0.219928
C  -2.332945 -1.703376 -0.63429
C  -2.001072 1.840558 -0.929438
H  -0.521721 -2.091273 0.471824
H  -1.822776 -1.404427 1.470858
H  -2.600529 0.8096 0.906505
H  -1.230946 1.920063 1.110012
H  1.554345 -1.724817 0.859274
H  -3.197247 -1.016285 -0.646989
H  -1.843592 -1.669232 -1.62251
H  -2.720549 -2.724869 -0.466589
H  -1.085569 2.245849 -1.390252
H  -2.45174 1.119385 -1.63246
H  -2.713368 2.673731 -0.779894
