program: Gaussian 09
title: 000136182
version: EM64L-G09RevD.01
frameworkgroup: C1[X(C2F4N2O4)]
method: RPBEPBE
basis: SDD
operation: Freq
keyword: #pfreq=noraman
keyword: PBEPBE/SDD
title: #p freq=noraman PBEPBE/SDD
converged: YES YES NO NO
title: Mulliken charges:
elementType: F F F F O O O O N N C C
charge: -0.100557 -0.100821 -0.100853 -0.100518 -0.116377 -0.116159 -0.116157 -0.116288 0.077617 0.077645 0.356276 0.356192
chargesum: 0.00000
title: Mulliken charges with hydrogens summed into heavy atoms:
polarizability: 6.71631039e+01 1.77775980e-03 7.06187652e+01 -8.26361071e+00 1.84305361e-01 3.63066957e+01
1716.lowfreq: -22.2470 -10.5500 -3.5234 -0.0015 -0.0010 -0.0004 7.3307 36.7530 43.8167
frequency: -22.2455 36.7194 43.8166 109.0422 158.4109 189.6001 242.1116 246.3778 301.3948 326.4078 331.7283 337.0912 465.3772 474.9977 528.6028 544.8290 560.4398 675.3315 715.3920 735.6335 789.8924 939.1604 1031.9483 1106.0421 1113.9184 1149.8584 1175.4094 1208.5203 1463.8450 1469.2875
redmass: 16.5885 16.4432 16.4385 16.5300 16.3456 18.3522 17.8782 17.4122 17.4614 17.0667 17.9128 16.5151 16.2954 15.6471 14.7263 17.3597 15.6094 15.7521 14.9657 15.4222 13.4934 12.4808 13.8910 12.7743 13.3518 13.5753 15.1255 13.8425 14.6113 14.6163
irintensity: 0.0654 0.0000 0.2846 2.7241 0.0000 2.3318 0.0003 2.3920 0.0000 5.9103 0.0003 0.0000 0.7439 24.6488 9.6932 0.0005 0.0000 0.0000 139.4006 0.0002 0.4456 0.0000 191.4228 0.0021 165.2356 0.0006 226.0766 0.0010 0.4788 331.0351
temp: 298.150 k
press: 1.00000 atm
elementType: 9 9 9 9 8 8 8 8 7 7 6 6
symmnumber: 1
zpe: 110482.2 jmol-1
zpe.correction: 0.042080 hartree
zpe.thermalcorrener: 0.052779 hartree
zpe.thermalcorrenthalpy: 0.053723 hartree
zpe.thermalcorrgfe: 0.004251 hartree
zpe.sumelectzpe: -884.825544 hartree
zpe.sumelectthermal: -884.814846 hartree
zpe.sumelectthermalent: -884.813902 hartree
zpe.sumelectthermalfe: -884.863374 hartree
dipole: -0.0010 0.0005 0.0004
dipole: 0.0012
quadrupole: -73.0264 -71.9181 -63.9960
quadrupole: -0.0197 2.9808 -0.0428
quadrupole: -3.3795 -2.2713 5.6508 -0.0197 2.9808 -0.0428
hfenergy: -884.8676244 hartree
pointgroup: C01 [X(C2F4N2O4)]
dipole: 0.0003931 -0.0002113 0.0001692 debye
dipolederiv: -0.2832738 -0.0328574 -0.0050905 -0.0842343 -0.4721766 -0.1863365 -0.0467212 -0.2308206 -0.412146 -0.2834448 0.032443 -0.0067412 0.0813623 -0.4515485 0.1886682 -0.0508074 0.2328593 -0.4328416 -0.2835035 0.0326948 -0.0069682 0.0815547 -0.4512468 0.1886927 -0.0510219 0.2328448 -0.4331312 -0.2830243 -0.0325445 -0.0047747 -0.0839443 -0.4724539 -0.1862827 -0.0464301 -0.2307782 -0.4118494 -0.4794442 -0.1634587 -0.1145332 -0.1247354 -0.6168499 -0.0083646 -0.2196169 -0.0728037 -0.1838563 -0.4814379 0.1597482 -0.1215168 0.1168241 -0.6113617 0.0258944 -0.2256116 0.0901246 -0.1879573 -0.4813673 0.1600569 -0.1211155 0.1171086 -0.611535 0.0248153 -0.2254836 0.0893258 -0.187692 -0.4796428 -0.1636763 -0.1142686 -0.1254953 -0.6170133 -0.0075248 -0.219461 -0.0718249 -0.1836283 1.0696334 0.0043449 0.2827195 0.0135099 1.1677828 -0.0188715 0.6904361 -0.0187516 0.1779709 1.0702871 0.0050983 0.2828806 0.014795 1.1678416 -0.0211065 0.6905332 -0.0207907 0.1781503 0.4579396 -0.000567 -0.0352121 -0.0030408 0.9842919 0.0001309 -0.1477948 0.0000683 1.0385325 0.4572784 -0.0012822 -0.0353793 -0.0037043 0.9842694 0.0002851 -0.1480209 0.000547 1.0384483 unknown
polarizability: 66.7515471|0.1442419|70.6048079|8.9888302|-0.7100086|36.7322098 unknown
InChI: InChI=1S/C2F4N2O4/c3-1(4,7(9)10)2(5,6)8(11)12
charge 0 multiplicity 1
12 atoms
F  -0.445598 1.171631 1.315073
F  -0.443806 -1.106963 1.371154
F  0.443234 1.105812 -1.371767
F  0.446628 -1.172788 -1.314345
O  -2.517251 -1.159481 -0.309813
O  2.523836 -1.137106 0.358641
O  -2.524141 1.138236 -0.356491
O  2.517075 1.160643 0.307412
N  -2.026823 -0.004486 -0.106468
N  2.026783 0.005232 0.106584
C  -0.550103 0.012901 0.550458
C  0.550167 -0.013533 -0.550438
