program: Gaussian 09
title: 000136175
version: EM64L-G09RevD.01
frameworkgroup: C1[X(C9H8F3NO)]
method: RPBEPBE
basis: SDD
operation: Freq
keyword: #p
keyword: freq=noraman
keyword: PBEPBE/SDD
title: #p freq=noraman PBEPBE/SDD
converged: NO YES NO NO
title: Mulliken charges:
elementType: F F F O N C C C C C C C C C H H H H H H H H
charge: -0.183999 -0.137625 -0.137857 -0.205020 -0.448613 0.502094 0.449554 -0.437895 -0.330123 -0.362748 -0.381360 -0.804443 0.134792 0.299435 0.225863 0.301837 0.236462 0.236531 0.347370 0.229650 0.226234 0.239861
chargesum: 0.00000
title: Mulliken charges with hydrogens summed into heavy atoms:
elementType: F F F O N C C C C C C C C C
charge: -0.183999 -0.137625 -0.137857 -0.205020 -0.101242 0.502094 0.449554 -0.212032 -0.028285 -0.126286 -0.144830 -0.108698 0.134792 0.299435
polarizability: 1.77812009e+02 7.91373884e+00 1.09838906e+02 6.24958123e-01 -1.02044455e-02 5.57484661e+01
1716.lowfreq: -40.4590 -15.5388 -6.0824 -5.0812 0.0004 0.0008 0.0008 19.2380 45.1964
frequency: -39.9402 19.1935 45.1545 65.6710 102.1699 159.2366 205.8704 249.6972 262.4956 300.0442 355.4995 360.0318 396.8259 407.2644 440.2647 476.4087 517.6597 527.8236 629.9844 640.1363 692.5141 710.2348 718.9419 750.7139 821.8484 825.8793 851.4496 851.9901 949.2836 985.7748 989.5190 1006.7252 1011.0907 1036.0959 1047.5030 1085.3738 1133.0814 1195.8886 1210.3618 1225.6377 1262.6491 1315.7071 1374.4315 1399.1776 1414.9513 1469.6176 1473.3176 1508.1177 1523.9725 1600.7194 1627.0778 1647.1482 2977.6692 3059.2730 3089.6409 3113.3518 3133.3409 3144.0391 3194.6603 3506.0690
redmass: 1.0235 10.3446 5.8880 5.1444 6.8290 4.6346 7.9631 9.1585 7.6534 6.3395 4.3121 4.5942 6.4935 2.9562 13.2348 9.1908 2.5636 8.2426 9.2601 9.1034 3.9880 1.7090 2.2505 4.9803 6.4162 1.4999 1.6737 3.1300 1.3500 1.3533 1.4335 6.2673 3.5373 12.5400 1.5636 6.6916 1.3053 1.1279 4.7676 2.6241 2.4107 1.3651 5.4324 1.2202 3.5152 1.1122 1.0543 2.5151 2.0616 4.1109 6.3895 9.5350 1.0392 1.0944 1.0999 1.0886 1.0911 1.0961 1.0946 1.0765
irintensity: 0.6276 0.1899 0.1898 1.5307 0.5203 7.5280 7.2250 0.6798 0.7767 3.4908 0.2072 1.4893 1.0567 0.0112 8.8257 18.9852 31.8413 5.1347 8.6989 8.0479 0.7579 49.2814 10.5152 6.4552 22.3664 68.0434 24.8353 31.0779 3.7873 1.2247 5.1869 123.4306 52.7149 260.8688 23.0874 217.6347 16.9331 2.2035 103.2884 1.5870 1.2819 4.3408 13.5727 9.6017 12.0238 24.8680 13.2675 31.3336 167.9563 23.4312 3.6622 333.4384 31.5613 21.5698 16.7446 13.6050 18.0013 14.0988 2.8315 47.5171
temp: 298.150 k
press: 1.00000 atm
elementType: 9 9 9 8 7 6 6 6 6 6 6 6 6 6 1 1 1 1 1 1 1 1
symmnumber: 1
zpe: 407306.1 jmol-1
zpe.correction: 0.155135 hartree
zpe.thermalcorrener: 0.167460 hartree
zpe.thermalcorrenthalpy: 0.168404 hartree
zpe.thermalcorrgfe: 0.114528 hartree
zpe.sumelectzpe: -776.250512 hartree
zpe.sumelectthermal: -776.238187 hartree
zpe.sumelectthermalent: -776.237243 hartree
zpe.sumelectthermalfe: -776.291118 hartree
dipole: 4.6054 2.8048 0.0626
dipole: 5.3926
quadrupole: -78.1419 -77.9019 -83.5994
quadrupole: -3.6238 0.3207 -0.0031
quadrupole: 1.7392 1.9792 -3.7184 -3.6238 0.3207 -0.0031
hfenergy: -776.4056466 hartree
pointgroup: C01 [X(C9H8F3N1O1)]
dipole: -1.8325958 1.0688672 -0.0206369 debye
dipolederiv: -0.5592583 -0.0715741 0.000458 -0.1333312 -0.8542858 -0.0012032 0.0007865 -0.0011452 -0.2945984 -0.7059817 0.0665167 -0.2606347 0.0390703 -0.2913218 0.1024719 -0.2736014 0.1243878 -0.6323504 -0.7031503 0.0647062 0.2606471 0.0369974 -0.2905364 -0.1011739 0.2744163 -0.1236772 -0.6364103 -0.5260896 -0.0718601 0.0006656 0.7461395 -0.8972148 -0.0018465 -0.0015442 0.0015351 -0.3047748 -1.1746305 0.2672344 0.0007455 0.3604913 -0.5054999 -0.0005208 0.0019661 -0.0015316 -0.2814884 0.7319214 0.004505 -0.0051043 0.1342043 0.0147136 -0.0016389 -0.0047805 0.0001324 0.0820658 0.4413343 0.0475025 0.0193265 0.0697733 -0.0766557 0.001498 0.1016716 0.0045338 -0.0317722 -0.083822 0.0022338 0.000386 0.0394701 0.0578436 0.0051332 -0.0062785 0.0032357 -0.1827994 -0.0916967 -0.0054644 0.0015654 -0.027975 -0.0586515 -0.0040744 -0.0067964 -0.0022629 -0.1422596 -0.1393112 -0.0310368 0.0013936 -0.2556365 0.0924632 -0.0066544 -0.0072686 -0.0078561 -0.1545304 -0.1959484 0.0312775 -0.0000861 0.188055 0.1302257 0.0069178 -0.0088708 0.0053623 -0.157118 -0.172455 -0.0220644 -0.0131425 -0.0336605 0.0762245 0.0005011 -0.1507675 -0.0030823 0.0644622 0.847303 -0.1747106 -0.0022379 -1.1362528 1.1817373 0.0024559 0.0018145 0.0000501 0.0988724 1.9255768 -0.1451086 0.0001404 0.0150768 1.3239888 0.0002141 -0.0029644 0.0006543 1.5811145 0.0212328 -0.1101294 0.0008693 -0.0930364 -0.0542838 -0.0007722 0.0033081 -0.001751 0.1675458 0.1159772 0.0580676 0.0003746 0.0341441 0.0694528 0.0007989 0.0034764 0.0012871 0.1799377 -0.0048401 0.103776 0.0029983 0.1015214 -0.0317624 0.0015706 0.0064683 -0.0028097 0.1505903 0.032334 -0.0777764 0.003372 -0.08806 -0.0618631 -0.0008374 0.0058679 0.0039918 0.1462061 0.2570933 0.0515092 0.0006691 -0.0008482 0.1814702 0.0000527 0.0010166 -0.0004017 0.31489 0.0282931 -0.0099065 0.0100757 -0.090815 -0.0712576 0.1008693 0.0746503 0.083587 0.0635475 -0.001205 0.0334152 0.0319581 0.1117023 -0.0492852 -0.0960935 0.091449 -0.0715627 0.0643839 -0.0426771 -0.0111128 -0.0544397 -0.0170304 0.1144983 -0.0076682 -0.1040194 -0.012677 -0.0955143 unknown
polarizability: 178.0900098|-6.6170644|109.562747|0.3941158|0.0639661|55.746624 unknown
InChI: InChI=1S/C9H8F3NO/c1-6-2-4-7(5-3-6)13-8(14)9(10,11)12/h2-5,13H,1H3
charge 0 multiplicity 1
22 atoms
F  3.09518 1.623314 -0.005286
F  3.876077 -0.192994 1.120274
F  3.869595 -0.187708 -1.143647
O  1.619596 -1.710013 -0.00339
N  0.708546 0.47964 -0.00083
C  -0.700418 0.243046 0.00457
C  -3.536588 -0.073215 0.015055
C  -1.548698 1.380156 0.009212
C  -1.266085 -1.057727 0.009099
C  -2.946757 1.217969 0.015742
C  -2.669285 -1.195177 0.015891
C  -5.044165 -0.244874 -0.011013
C  1.718066 -0.45454 -0.006405
C  3.135907 0.189542 -0.008631
H  -1.117353 2.389457 0.011641
H  -0.615735 -1.934327 0.010726
H  -3.589505 2.105831 0.022373
H  -3.099022 -2.203841 0.022734
H  0.997967 1.462961 -0.000808
H  -5.354946 -1.176416 0.492983
H  -5.558252 0.598549 0.48199
H  -5.419626 -0.294932 -1.051682
