program: Gaussian 09
title: 000136173
version: EM64L-G09RevD.01
frameworkgroup: C1[X(C6H3Cl2F)]
method: RPBEPBE
basis: SDD
operation: Freq
keyword: #p
keyword: freq=noraman
keyword: PBEPBE/SDD
title: #p freq=noraman PBEPBE/SDD
converged: NO NO NO NO
title: Mulliken charges:
elementType: Cl Cl F C C C C C C H H H
charge: 0.008810 -0.029322 -0.175566 0.468964 -0.327173 -0.315823 -0.067280 -0.165052 -0.212863 0.287113 0.264258 0.263934
chargesum: 0.00000
title: Mulliken charges with hydrogens summed into heavy atoms:
elementType: Cl Cl F C C C C C C
charge: 0.008810 -0.029322 -0.175566 0.468964 -0.327173 -0.028710 -0.067280 0.099206 0.051071
polarizability: 1.30046432e+02 1.94197388e+00 7.77033658e+01 -5.68387383e-04 -1.92159744e-03 3.05136643e+01
1716.lowfreq: -4.3620 -0.0041 -0.0035 -0.0034 9.3765 17.2426 92.8670 191.6502 202.1447
frequency: 92.8557 191.6460 202.1201 230.8141 293.5393 311.5737 422.8545 441.5465 523.3558 552.8192 567.7021 681.1514 686.1071 805.8890 857.9211 859.5971 940.1718 1025.8149 1073.0826 1136.5871 1211.5832 1239.1505 1362.5693 1390.8334 1455.2791 1578.9712 1586.5418 3159.1887 3172.9923 3178.5538
redmass: 12.4443 17.0817 6.7693 13.9772 7.2014 25.2923 6.8274 3.1205 9.3796 8.5640 5.4914 7.3780 3.8549 1.3208 7.6304 1.4606 1.3243 7.4028 1.8395 1.4828 3.0708 1.3085 9.5061 3.8445 2.7618 9.1456 7.2602 1.0890 1.0934 1.0977
irintensity: 0.3519 0.4134 0.0255 1.2210 0.2692 0.1056 2.3605 11.1736 5.9542 32.7204 9.3597 2.8628 0.1414 37.7064 58.3840 39.0310 0.0710 53.0782 44.6587 12.0656 28.1246 1.4918 4.8684 20.0564 142.0753 28.2872 23.0985 0.3581 1.0908 0.7369
temp: 298.150 k
press: 1.00000 atm
elementType: 17 17 9 6 6 6 6 6 6 1 1 1
symmnumber: 1
zpe: 186813.7 jmol-1
zpe.correction: 0.071154 hartree
zpe.thermalcorrener: 0.078977 hartree
zpe.thermalcorrenthalpy: 0.079921 hartree
zpe.thermalcorrgfe: 0.037571 hartree
zpe.sumelectzpe: -1249.751127 hartree
zpe.sumelectthermal: -1249.743304 hartree
zpe.sumelectthermalent: -1249.742359 hartree
zpe.sumelectthermalfe: -1249.784710 hartree
dipole: 0.9153 -1.6422 0.0002
dipole: 1.8801
quadrupole: -70.6628 -59.6920 -66.5003
quadrupole: 2.4937 -0.0002 -0.0001
quadrupole: -5.0444 5.9263 -0.8819 2.4937 -0.0002 -0.0001
hfenergy: -1249.8222807 hartree
pointgroup: C01 [X(C6H3Cl2F1)]
dipole: 0.4179601 0.6102649 -0.0000647 debye
dipolederiv: -0.7160335 0.0951449 -0.0000044 0.1270538 -0.0851282 0.0000015 -0.0000088 0.0000035 -0.0160424 -0.7912001 0.1135373 -0.0000158 0.1271621 -0.1336415 0.0000052 -0.0000073 -0.0000014 -0.048489 -0.5054272 -0.3923669 0.0000413 -0.4072742 -0.6935471 0.0000546 0.0000803 0.0000999 -0.1255539 0.4110888 0.4721496 -0.0000713 0.4057971 0.824551 -0.0000792 -0.0001027 -0.0001398 0.1413497 1.0255293 -0.1432548 0.00001 -0.2661442 -0.0910379 0.0000119 0.000041 0.0000115 -0.1082806 -0.3940332 -0.1207237 0.0000206 0.060884 -0.1108257 0.0000005 -0.0000024 0.0000156 -0.114154 1.2068408 -0.1489978 0.000035 -0.2391281 0.2358563 -0.0000163 0.0000173 -0.0000103 -0.0654847 -0.1130505 -0.0100983 -0.0000022 0.0665293 0.0429288 -0.0000015 0.0000045 -0.0000057 -0.0728348 -0.3032521 0.1140416 -0.0000098 0.1181125 -0.063902 0.0000012 -0.0000115 -0.0000027 -0.1244706 0.084193 0.0317453 -0.0000049 0.0184497 0.0383011 0.0000091 -0.0000018 0.0000164 0.1916406 0.0656975 0.0501694 0. 0.0411912 0.0032882 0.0000061 -0.0000112 0.0000062 0.1664637 0.0296471 -0.0613467 0.0000016 -0.0526332 0.033157 0.0000068 0.0000025 0.0000069 0.1758558 unknown
polarizability: 129.248807|-6.6996419|78.5009909|0.0003894|-0.0019657|30.5136643 unknown
InChI: InChI=1S/C6H3Cl2F/c7-4-1-2-5(8)6(9)3-4/h1-3H
charge 0 multiplicity 1
12 atoms
Cl -2.978669 0.774242 -0.000033
Cl 3.356012 -0.314798 0.000043
F  -1.574093 -1.915032 0.000182
C  -0.692481 -0.834599 -0.000006
C  -1.197999 0.484177 -0.000028
C  0.68827 -1.096308 -0.000013
C  1.574455 -0.000719 -0.00001
C  -0.291492 1.564603 -0.000082
C  1.10149 1.329781 -0.000075
H  1.041759 -2.13186 0.000049
H  -0.674147 2.589775 -0.000115
H  1.801296 2.170537 -0.000112
