program: Gaussian 09
title: 000136169
version: EM64L-G09RevD.01
frameworkgroup: C1[X(C5H8F4)]
method: RPBEPBE
basis: SDD
operation: Freq
keyword: #p
keyword: freq=noraman
keyword: PBEPBE/SDD
title: #p freq=noraman PBEPBE/SDD
converged: YES YES NO NO
title: Mulliken charges:
elementType: F F F F C C C C C H H H H H H H H
charge: -0.240371 -0.240383 -0.240387 -0.240377 0.097366 -0.240779 -0.240811 -0.240828 -0.240798 0.228410 0.228491 0.228313 0.228514 0.228391 0.228391 0.228368 0.228490
chargesum: 0.00000
title: Mulliken charges with hydrogens summed into heavy atoms:
elementType: F F F F C C C C C
charge: -0.240371 -0.240383 -0.240387 -0.240377 0.097366 0.216122 0.216016 0.215954 0.216059
polarizability: 5.36429911e+01 -1.90015325e-05 5.36319641e+01 -3.16904575e-03 -5.21449813e-03 5.24514877e+01
1716.lowfreq: -0.0010 -0.0010 -0.0003 21.8233 30.4788 30.6089 69.8632 103.5332 103.5837
frequency: 69.8629 103.5067 103.5561 137.3087 147.3892 243.7277 261.3011 261.3637 308.3170 368.4441 383.1673 572.6849 572.8651 803.6228 898.5016 898.5338 927.1102 927.1748 930.3964 968.6123 976.3308 1044.4193 1144.0244 1144.0998 1190.9294 1209.7007 1221.2301 1271.0336 1271.0427 1374.1419 1374.1504 1381.4756 1395.1162 1457.8647 1457.8847 1465.9282 1468.9569 3033.9220 3033.9248 3038.3514 3039.4455 3109.1151 3111.9990 3114.8379 3114.8494
redmass: 9.2790 7.4517 7.4579 11.0760 2.2599 6.8416 3.1836 3.1813 1.9539 10.2840 7.0968 3.0427 3.0435 4.1558 3.1568 3.1574 4.3012 4.2962 1.3639 8.1949 7.5197 1.6113 1.6427 1.6423 1.0591 1.0265 7.7705 1.3398 1.3397 1.3774 1.3772 1.2493 1.2253 1.0754 1.0753 1.0812 1.0777 1.0546 1.0546 1.0550 1.0566 1.1102 1.1133 1.1118 1.1118
irintensity: 0.0000 10.0520 10.0535 0.0001 0.0005 23.2934 22.2010 22.2438 0.0015 0.0000 1.3718 12.5053 12.5333 0.0000 0.4038 0.4161 113.5972 113.7693 0.0089 44.6564 0.0012 0.0000 7.5257 7.5367 0.0001 0.0003 7.0549 0.3530 0.3517 2.1319 2.1247 13.6070 0.0001 2.8558 2.8592 0.0000 24.8939 0.0146 0.0333 105.0913 0.0005 0.0093 0.0389 20.3615 20.3271
temp: 298.150 k
press: 1.00000 atm
elementType: 9 9 9 9 6 6 6 6 6 1 1 1 1 1 1 1 1
symmnumber: 1
zpe: 336941.5 jmol-1
zpe.correction: 0.128334 hartree
zpe.thermalcorrener: 0.138211 hartree
zpe.thermalcorrenthalpy: 0.139155 hartree
zpe.thermalcorrgfe: 0.092682 hartree
zpe.sumelectzpe: -593.948429 hartree
zpe.sumelectthermal: -593.938552 hartree
zpe.sumelectthermalent: -593.937608 hartree
zpe.sumelectthermalfe: -593.984081 hartree
dipole: -0.0131 -0.0079 0.0000
dipole: 0.0153
quadrupole: -61.7014 -61.6785 -42.5357
quadrupole: 0.0000 0.0001 0.0005
quadrupole: -6.3962 -6.3733 12.7695 0.0000 0.0001 0.0005
hfenergy: -594.0767628 hartree
pointgroup: C01 [X(C5H8F4)]
dipole: -0.0051509 -0.0031117 -0.0000006 debye
dipolederiv: -0.4865953 -0.2145734 -0.0668144 -0.2144069 -0.488377 -0.0668891 -0.117533 -0.117756 -0.3746052 -0.4880802 0.2143351 -0.0666244 0.214781 -0.4872253 0.0668784 -0.1174258 0.1176824 -0.3745062 -0.4863701 -0.2145814 0.066465 -0.2146295 -0.4891525 0.0668824 0.1171101 0.1178522 -0.3744278 -0.4900511 0.214741 0.0673513 0.2143125 -0.4851392 -0.0661921 0.1184948 -0.1166376 -0.3745269 -0.1463059 0.0000662 0.00026 -0.0000703 -0.146202 0.0004393 0.0002999 0.0005171 -0.1678291 0.5038306 0.2064702 0.0852515 0.2066147 0.5057109 0.0855059 0.0499853 0.0497307 0.3983128 0.5054603 -0.2066234 0.0853179 -0.2062953 0.5043169 -0.085354 0.0493621 -0.0501175 0.3981412 0.5036195 0.206422 -0.0850112 0.2063994 0.5063068 -0.0855839 -0.0494822 -0.0498126 0.3980223 0.5070486 -0.2063011 -0.0859601 -0.2066641 0.5026405 0.084711 -0.0505526 0.0489717 0.3981947 -0.0099418 0.0286321 0.0753834 0.023664 0.0295421 -0.1056682 0.0339166 -0.0687053 0.008891 0.029236 0.0240615 -0.1059324 0.0289775 -0.0098725 0.0747381 -0.068811 0.0335133 0.0094975 0.0293725 -0.0236984 -0.1057727 -0.0286071 -0.0099125 -0.075315 -0.0687292 -0.0339713 0.0084354 -0.0100585 -0.0291717 0.0747728 -0.024275 0.0291611 0.1057952 0.0334754 0.0686972 0.0098436 -0.0101997 0.0288391 -0.0754049 0.0239356 0.0293686 0.1055241 -0.0339336 0.0685762 0.0091319 0.0290006 0.0241789 0.106037 0.0290405 -0.0098517 -0.0746638 0.0688085 -0.0335229 0.0090936 -0.0094473 -0.0287996 -0.0746092 -0.0238684 0.0291387 -0.1062954 -0.0334827 -0.0689702 0.0084883 0.0294817 -0.0239973 0.1052905 -0.0289088 -0.0104529 0.0754871 0.0684974 0.0339527 0.0098427 unknown
polarizability: 53.6429926|0.0000323|53.6319675|-0.0028509|-0.0048371|52.4514828 unknown
InChI: InChI=1S/C5H8F4/c6-1-5(2-7,3-8)4-9/h1-4H2
charge 0 multiplicity 1
17 atoms
F  1.719176 1.727659 -0.041211
F  -1.729316 1.721224 0.042254
F  -1.721172 -1.731696 -0.043028
F  1.73216 -1.716981 0.042035
C  -0.001944 -0.001241 0.000014
C  0.880947 0.887524 -0.90201
C  -0.890691 0.881079 0.902639
C  -0.884345 -0.889439 -0.903077
C  0.886388 -0.884105 0.902496
H  1.566147 0.282389 -1.519851
H  0.271534 1.570916 -1.51768
H  -0.285499 1.564816 1.522012
H  -1.575207 0.271353 1.516702
H  -1.570407 -0.284075 -1.519665
H  -0.274488 -1.571348 -1.519896
H  1.566092 -0.27426 1.52181
H  0.281424 -1.572715 1.516656
