program: Gaussian 09
title: 000136156
version: EM64L-G09RevD.01
frameworkgroup: C1[X(C24H15N)]
method: RPBEPBE
basis: SDD
operation: Freq
keyword: #pfreq=noraman
keyword: PBEPBE/SDD
title: #p freq=noraman PBEPBE/SDD
converged: NO YES NO YES
title: Mulliken charges:
elementType: N C C C C C C C C C C C C C C C C C C C C C C C C H H H H H H H H H H H H H H H
charge: -0.468343 0.035421 0.350684 0.207035 0.444070 0.176455 0.443637 0.184174 0.433400 -0.662993 -0.748351 -0.396193 -0.481904 -0.689075 -0.674662 0.405046 0.403004 -0.332463 -0.372863 -0.286792 -0.219884 -0.429611 -0.423114 -0.244399 -0.245750 0.231659 0.304612 0.249911 0.235996 0.246099 0.247281 0.246655 0.217904 0.232864 0.222375 0.223999 0.240692 0.239777 0.226746 0.226902
chargesum: 0.00000
title: Mulliken charges with hydrogens summed into heavy atoms:
elementType: N C C C C C C C C C C C C C C C C C C C C C C C C
charge: -0.163731 0.035421 0.350684 0.207035 0.444070 0.176455 0.443637 0.184174 0.433400 -0.431334 -0.498440 -0.160197 -0.235805 -0.441794 -0.428007 0.405046 0.403004 -0.114559 -0.139999 -0.064417 0.004115 -0.188919 -0.183337 -0.017652 -0.018848
polarizability: 5.99005577e+02 8.63897773e+00 3.19462736e+02 8.89669192e-03 -1.92274475e-02 9.82978874e+01
1716.lowfreq: -8.9996 -0.0006 -0.0003 0.0007 3.7051 7.2135 44.1923 48.9567 85.4687
frequency: 44.1664 48.9462 85.4684 95.2651 115.8862 174.9238 183.2736 184.0114 265.2019 268.7333 285.2010 309.3075 322.2028 363.7374 400.6279 410.8945 419.2581 434.8004 468.9130 471.3425 506.1732 512.4827 521.2519 536.3086 542.7672 550.2980 583.4694 585.4604 618.5856 625.4877 639.5677 655.6946 692.7768 742.3938 744.2524 750.6412 751.4957 757.5770 761.3897 788.9586 790.0937 792.9092 806.9727 834.6558 844.0051 851.3955 853.6777 863.1730 897.6863 901.2817 920.2530 925.4101 930.9005 946.0822 962.1375 968.8054 971.4106 988.2949 1004.3950 1010.3961 1036.6704 1106.5430 1122.3921 1125.3304 1166.5873 1170.1558 1181.0759 1187.3323 1204.7585 1214.2457 1226.8620 1253.2383 1261.1992 1281.0539 1287.6383 1292.5046 1311.0497 1335.8990 1356.5993 1386.0359 1389.3171 1413.1765 1426.0601 1429.0696 1434.5647 1443.8186 1450.0775 1463.2679 1483.2600 1485.5592 1533.3161 1550.2241 1554.6810 1576.6483 1583.2505 1607.2524 1624.0851 1631.1982 1639.0328 3111.6530 3113.6020 3116.0532 3117.4161 3122.6213 3125.8827 3126.3642 3137.2427 3140.8560 3149.7059 3153.4634 3159.9766 3161.5852 3172.9372 3607.7998
redmass: 5.0767 4.4354 5.7298 4.7831 4.5329 4.8576 4.2583 5.6462 6.5863 4.9749 4.7461 5.3446 4.0642 4.0981 5.7696 3.6494 5.2423 2.9301 2.3946 2.7498 6.9449 1.1588 5.7385 3.8904 5.0873 3.3695 3.6514 6.6398 6.8931 6.9126 6.5394 3.4391 6.1909 1.9016 5.8714 2.3286 1.2683 5.8738 2.6795 2.2959 5.1752 1.9627 1.7435 3.4563 1.4626 1.4426 5.2214 1.5169 1.8990 5.6710 1.5359 5.6223 1.4161 1.9470 1.5614 1.4197 1.3134 1.3503 3.0951 2.3503 2.5413 2.3348 1.6786 1.7150 1.1533 1.1012 1.4228 1.3896 1.5532 1.6997 1.3423 1.9222 2.3821 2.4783 1.8142 1.9258 2.6340 2.4412 2.4248 2.3902 4.0988 2.8572 3.4704 4.0128 5.3599 3.7640 3.4424 3.5612 4.3771 3.4432 5.2627 5.4783 6.7345 6.3857 6.0099 6.5829 6.7023 7.1862 6.8615 1.0911 1.0913 1.0910 1.0858 1.0884 1.0862 1.0859 1.0898 1.0952 1.0983 1.0942 1.1002 1.0936 1.0951 1.0804
irintensity: 1.5011 0.1648 0.5271 0.0011 1.9714 0.0488 0.9725 0.5367 0.8182 3.0729 0.3148 0.8547 0.4139 1.1876 6.1748 1.9126 0.4223 2.0773 22.6847 3.6932 0.3033 88.2757 5.0488 0.7611 2.2458 5.3184 0.1776 2.4052 5.2311 2.8196 0.6074 24.6446 0.6769 42.5676 0.3323 19.9061 77.6705 0.2201 0.5710 4.9598 3.1355 40.9977 14.1633 0.5896 1.1895 0.9606 0.5571 0.0242 0.5843 0.8924 81.9345 2.5011 21.0197 0.0860 2.4174 19.7596 0.2378 0.0001 2.5118 7.3999 26.9832 4.8621 3.7386 5.1030 8.3259 1.0378 3.5707 8.6947 8.2627 6.7746 4.6938 6.7051 27.1673 11.3377 1.4443 5.4044 6.4406 8.3913 103.9322 7.3000 14.4289 8.0134 1.9492 1.2021 9.4242 8.9435 2.7494 11.2704 25.5190 13.5385 1.4894 0.2552 1.4398 8.3442 28.5110 36.5317 48.9283 2.1362 18.8805 2.1318 17.9047 4.5478 7.7297 1.8455 0.4582 1.9056 11.6516 35.0571 34.1282 44.5981 57.3107 7.8068 21.9139 88.4739
temp: 298.150 k
press: 1.00000 atm
elementType: 7 6 6 6 6 6 6 6 6 6 6 6 6 6 6 6 6 6 6 6 6 6 6 6 6 1 1 1 1 1 1 1 1 1 1 1 1 1 1 1
symmnumber: 1
zpe: 819593.4 jmol-1
zpe.correction: 0.312167 hartree
zpe.thermalcorrener: 0.329260 hartree
zpe.thermalcorrenthalpy: 0.330204 hartree
zpe.thermalcorrgfe: 0.267733 hartree
zpe.sumelectzpe: -976.730339 hartree
zpe.sumelectthermal: -976.713246 hartree
zpe.sumelectthermalent: -976.712302 hartree
zpe.sumelectthermalfe: -976.774773 hartree
dipole: 2.0734 1.5242 -0.0002
dipole: 2.5733
quadrupole: -111.0876 -121.1433 -155.7851
quadrupole: 7.8428 -0.0010 -0.0032
quadrupole: 18.2510 8.1954 -26.4465 7.8428 -0.0010 -0.0032
hfenergy: -977.042506 hartree
pointgroup: C01 [X(C24H15N1)]
dipole: 0.8138981 -0.602136 0.0000859 debye
polarizability: 598.9502467|-9.4918913|319.5180664|-0.0089553|-0.0192002|98.2978874 unknown
InChI: InChI=1S/C24H15N/c1-2-6-16-12-19-14-21-17(13-18(19)11-15(16)5-1)9-10-23-24(21)20-7-3-4-8-22(20)25-23/h1-14,25H
charge 0 multiplicity 1
40 atoms
N  4.517045 -1.146223 0.000162
C  2.334018 -0.418357 0.000094
C  0.896513 -0.60147 0.000151
C  3.180369 -1.561935 0.000144
C  0.390708 -1.985204 0.000244
C  3.208824 0.74899 -0.000071
C  -1.44673 0.223996 0.00013
C  4.566558 0.254347 0.000015
C  -1.945957 -1.154586 0.000238
C  -0.037342 0.452516 0.000077
C  -0.99809 -2.217985 0.000298
C  2.691899 -2.906252 0.000238
C  1.318539 -3.098882 0.000288
C  -2.386437 1.291747 0.00007
C  -3.349495 -1.385167 0.000271
C  -3.77972 1.058663 0.000108
C  -4.276663 -0.320254 0.00021
C  3.012832 2.156557 -0.000243
C  5.691262 1.104678 -0.00007
C  4.131501 3.013231 -0.000357
C  5.458254 2.495267 -0.000285
C  -4.73919 2.137272 0.000044
C  -5.70298 -0.542672 0.000232
C  -6.105286 1.880596 0.000065
C  -6.593712 0.524154 0.00017
H  0.311034 1.488979 -0.000005
H  5.324678 -1.765158 0.000297
H  -1.363951 -3.252864 0.000379
H  3.383104 -3.756049 0.000298
H  0.906712 -4.11461 0.000368
H  -2.017889 2.325676 -0.000007
H  -3.719431 -2.418719 0.000352
H  2.008774 2.58923 -0.000296
H  6.711151 0.704033 -0.000011
H  3.980347 4.098259 -0.000505
H  6.30845 3.186266 -0.000378
H  -4.368681 3.169624 -0.000028
H  -6.073117 -1.575188 0.000304
H  -6.821587 2.70977 0.000011
H  -7.674014 0.341423 0.000198
