program: Gaussian 09
title: 000136142
version: EM64L-G09RevD.01
frameworkgroup: C1[X(C5H6O2)]
method: RPBEPBE
basis: SDD
operation: Freq
keyword: #p
keyword: freq=noraman
keyword: PBEPBE/SDD
title: #p freq=noraman PBEPBE/SDD
converged: NO YES NO NO
title: Mulliken charges:
elementType: O O C C C C C H H H H H H
charge: -0.227706 -0.227704 -0.249340 -0.194996 -0.195013 -0.135116 -0.135110 0.245453 0.230891 0.209686 0.209683 0.234637 0.234635
chargesum: 0.00000
title: Mulliken charges with hydrogens summed into heavy atoms:
elementType: O O C C C C C
charge: -0.227706 -0.227704 0.227003 0.014690 0.014670 0.099520 0.099525
polarizability: 7.28941424e+01 -3.39635596e-04 6.78043276e+01 7.15309220e-04 1.24315677e+00 3.08719678e+01
1716.lowfreq: -13.3309 -10.0091 -0.0008 -0.0006 -0.0003 10.8782 151.6111 241.7412 363.8681
frequency: 151.5941 241.7392 363.8664 416.7234 466.3443 588.5022 679.1488 745.4894 760.9112 819.1078 841.0718 886.4222 908.3909 923.4089 927.6319 968.9358 1091.3955 1136.7665 1237.2928 1259.1823 1275.6340 1347.7057 1391.4414 1397.2095 1443.4949 1614.4229 1623.4722 3011.9312 3128.6827 3144.0056 3159.5124 3180.0463 3185.0907
redmass: 4.4688 2.4117 6.5819 2.9996 5.5625 3.6072 3.9110 1.3597 1.8497 3.0820 5.0949 5.7327 1.4214 3.0015 1.2855 4.4588 1.8152 2.2868 1.1955 1.0619 1.2658 1.1948 1.2067 1.4763 1.1218 4.9897 9.3223 1.0632 1.0846 1.0878 1.1045 1.0967 1.0988
irintensity: 0.5584 5.3326 3.3489 16.5390 24.2346 0.4826 14.7229 100.4993 37.0678 39.5109 21.0510 2.4235 3.6261 6.7881 0.0584 1.0519 19.8321 110.3281 0.3490 0.0002 50.6753 0.0394 2.2236 8.4382 8.7716 11.2077 86.6335 47.7102 9.1259 5.5564 12.4913 19.3854 9.1724
temp: 298.150 k
press: 1.00000 atm
elementType: 8 8 6 6 6 6 6 1 1 1 1 1 1
symmnumber: 1
zpe: 265072.0 jmol-1
zpe.correction: 0.100961 hartree
zpe.thermalcorrener: 0.106809 hartree
zpe.thermalcorrenthalpy: 0.107753 hartree
zpe.thermalcorrgfe: 0.071440 hartree
zpe.sumelectzpe: -343.987923 hartree
zpe.sumelectthermal: -343.982075 hartree
zpe.sumelectthermalent: -343.981131 hartree
zpe.sumelectthermalfe: -344.017443 hartree
dipole: 0.0003 1.0630 1.7428
dipole: 2.0414
quadrupole: -38.7195 -37.2900 -43.7676
quadrupole: -0.0001 0.0004 -1.9577
quadrupole: 1.2062 2.6357 -3.8419 -0.0001 0.0004 -1.9577
hfenergy: -344.0888836 hartree
pointgroup: C01 [X(C5H6O2)]
dipole: -0.0001035 0.436914 -0.673904 debye
dipolederiv: -0.4791399 0.3294716 -0.0045209 -0.1359989 -0.9606724 -0.0758804 0.1761772 0.0173657 -0.3341978 -0.4790644 -0.3293215 0.0045318 0.1362496 -0.9608205 -0.0758792 -0.1761367 0.0172349 -0.3341926 0.7094563 0.0000337 -0.0000413 0.0000052 0.5623596 0.1253312 -0.0000581 0.1575806 0.6225437 0.006619 -0.20125 0.0187812 -0.1883851 -0.1655653 -0.0402367 0.032336 0.0270555 -0.2072633 0.0063434 0.2013243 -0.0187402 0.188508 -0.1654817 -0.0402064 -0.0323259 0.0271087 -0.2073121 0.1214646 -0.0975516 0.023718 0.1690045 0.8820701 -0.0017715 -0.0104159 -0.1043616 -0.1179145 0.1215432 0.0972828 -0.0236552 -0.1693818 0.8821623 -0.001736 0.0104936 -0.104272 -0.117882 0.0685296 0.0000364 0.0000079 0.0000251 -0.0941008 -0.0349056 -0.000003 0.0046121 0.0971058 0.0171062 -0.0000149 -0.0000168 -0.0000057 0.0617935 0.1144959 0.0000087 -0.0528153 -0.118074 0.0272552 0.0578366 -0.0054208 0.0994176 -0.0680665 0.0190915 -0.0160592 0.0217901 0.169154 0.0272944 -0.0578108 0.005391 -0.0993872 -0.0681184 0.0190671 0.0160254 0.0217694 0.1691653 -0.0737129 0.0446865 0.0166673 0.025293 0.0472316 -0.003676 -0.0347243 -0.0165316 0.1894394 -0.0736947 -0.0447231 -0.0167019 -0.0253444 0.0472086 -0.003694 0.0346821 -0.0165365 0.189428 unknown
polarizability: 72.8941423|0.0003459|67.8447503|0.0016471|-0.2256081|30.8315452 unknown
InChI: InChI=1S/C5H6O2/c1-2-4-7-5-6-3-1/h1-4H,5H2
charge 0 multiplicity 1
13 atoms
O  -1.234435 -1.021632 0.209926
O  1.234741 -1.021278 0.209872
C  0.000179 -1.437953 -0.450453
C  -0.732145 1.389508 -0.056118
C  0.731625 1.38973 -0.056044
C  -1.590173 0.333119 0.099674
C  1.58998 0.333604 0.099784
H  0.00036 -2.533318 -0.394544
H  0.000121 -1.047643 -1.485579
H  -1.213904 2.369728 -0.150287
H  1.213095 2.370105 -0.150086
H  -2.675375 0.453331 0.156948
H  2.675132 0.454197 0.157207
