program: Gaussian 09
title: 000136125
version: EM64L-G09RevD.01
frameworkgroup: C1[X(C10H16)]
method: RPBEPBE
basis: SDD
operation: Freq
keyword: #p
keyword: freq=noraman
keyword: PBEPBE/SDD
title: #p freq=noraman PBEPBE/SDD
converged: NO YES NO NO
title: Mulliken charges:
elementType: C C C C C C C C C C H H H H H H H H H H H H H H H H
charge: -0.157443 -0.157440 -0.157432 -0.157453 -0.577685 -0.577685 -0.399408 -0.399418 -0.399420 -0.399407 0.233837 0.233838 0.233835 0.233841 0.236256 0.216706 0.236256 0.216706 0.191066 0.194310 0.194313 0.191066 0.191067 0.194311 0.194315 0.191065
chargesum: 0.00000
title: Mulliken charges with hydrogens summed into heavy atoms:
elementType: C C C C C C C C C C
charge: 0.076394 0.076398 0.076403 0.076389 -0.124722 -0.124722 -0.014031 -0.014039 -0.014042 -0.014027
polarizability: 1.14092930e+02 9.36737144e-05 1.00567077e+02 -2.88813125e+00 3.06511408e-05 8.34405249e+01
1716.lowfreq: -0.0001 0.0006 0.0008 18.9967 20.5834 29.2748 118.3267 170.2571 185.7441
frequency: 118.3267 170.2571 185.7259 200.2495 292.9150 306.1994 324.1330 374.3110 385.7051 512.2012 519.4287 522.6982 676.1508 745.5463 751.9841 752.3446 839.9440 850.6644 855.3361 892.6234 895.5794 934.5646 952.5051 986.8644 1011.3463 1026.3200 1030.8212 1037.9058 1037.9642 1062.4967 1075.8830 1108.0746 1111.4323 1116.1639 1149.6147 1162.0218 1206.6122 1207.2822 1229.9169 1239.1926 1246.3173 1256.2671 1295.7129 1313.0389 1314.6574 1323.4059 1365.9423 1369.4270 1399.8273 1403.9841 1459.1867 1461.9237 1465.3197 1466.4826 1474.4998 1483.6745 2970.1282 2972.7836 2978.0741 2982.4953 3020.3543 3026.1945 3027.9117 3032.0197 3071.4599 3072.0799 3078.4376 3078.6304 3090.3627 3090.5859 3181.2904 3181.3231
redmass: 2.5424 2.2435 2.7224 2.9822 2.3816 2.5938 1.7562 2.8024 2.8085 2.6408 2.5565 1.9069 2.3232 2.2624 2.0790 3.2237 1.3389 1.2096 1.2319 1.7936 1.8841 3.3946 1.6809 1.8577 3.0995 1.5428 3.6695 1.2626 1.3936 2.5278 1.8529 1.2612 1.1728 1.2334 1.7431 1.7858 1.2710 1.2480 1.2528 1.3053 1.3419 1.4160 1.2164 1.2821 1.3225 1.3588 1.5560 1.5495 1.8557 1.8251 1.3372 1.3982 1.0720 1.0885 1.0786 1.1227 1.0605 1.0622 1.0622 1.0622 1.0996 1.1008 1.0981 1.1003 1.0879 1.0877 1.0576 1.0571 1.0916 1.0917 1.1147 1.1147
irintensity: 0.1902 0.1240 0.0000 0.0000 0.0172 0.0000 0.8479 0.0000 0.0000 10.3239 1.9573 0.0000 0.0000 10.5124 0.0008 11.4900 0.0000 0.8492 35.7726 0.0000 0.9533 7.4543 0.0000 0.0000 5.1870 0.0000 0.0000 37.7277 0.0237 0.0011 0.0000 2.7895 0.2406 0.0000 0.0000 2.9907 3.6179 0.0000 0.0015 0.0000 0.0000 0.4291 0.0000 0.4443 2.9636 0.0000 0.3387 0.0000 6.1034 0.0000 5.2883 0.0000 7.7408 0.0000 0.0000 38.7380 0.0000 73.5190 66.6841 0.0000 0.0000 108.1399 35.6031 0.0000 47.1939 0.0000 0.0030 61.4102 80.4110 0.0001 56.1239 0.0889
temp: 298.150 k
press: 1.00000 atm
elementType: 6 6 6 6 6 6 6 6 6 6 1 1 1 1 1 1 1 1 1 1 1 1 1 1 1 1
symmnumber: 1
zpe: 614958.9 jmol-1
zpe.correction: 0.234225 hartree
zpe.thermalcorrener: 0.243407 hartree
zpe.thermalcorrenthalpy: 0.244351 hartree
zpe.thermalcorrgfe: 0.200783 hartree
zpe.sumelectzpe: -389.799658 hartree
zpe.sumelectthermal: -389.790476 hartree
zpe.sumelectthermalent: -389.789532 hartree
zpe.sumelectthermalfe: -389.833100 hartree
dipole: 0.0000 0.0000 0.0000
dipole: 0.0000
quadrupole: -64.0433 -62.7714 -60.3300
quadrupole: 0.0000 1.8953 0.0001
quadrupole: -1.6617 -0.3898 2.0516 0.0000 1.8953 0.0001
hfenergy: -390.0338831 hartree
pointgroup: C01 [X(C10H16)]
dipole: -0.0000002 0.000013 0.0000035 debye
dipolederiv: 0.0907919 0.0626029 0.0284412 0.0824747 -0.056228 -0.0453046 0.0366301 -0.0367305 0.1118066 0.0908724 -0.0625484 0.0284186 -0.082433 -0.0562666 0.0453117 0.0365978 0.0367361 0.1118145 0.0908615 -0.0625608 0.0284248 -0.0824376 -0.0562582 0.0453124 0.0366049 0.0367381 0.1118046 0.0907983 0.0625969 0.0284314 0.0824725 -0.056236 -0.0452937 0.0366209 -0.0367263 0.1118131 -0.2321649 -0.0000227 0.141882 -0.0000348 -0.022652 0.0000174 0.143729 0.0000173 0.0265195 -0.23217 -0.0000214 0.1418767 -0.0000279 -0.0226486 0.0000071 0.1437236 0.0000126 0.0265263 0.0595437 0.0026861 -0.0131156 0.0142239 0.137081 0.0201801 0.0061397 -0.0567712 0.0692221 0.0595109 -0.0027167 -0.0131073 -0.0142419 0.1370841 -0.0201873 0.0061324 0.0567722 0.0692256 0.0595209 -0.0027084 -0.0131019 -0.0142397 0.1370749 -0.0201899 0.0061375 0.0567642 0.0692298 0.0595335 0.0026912 -0.0131228 0.0142308 0.1370911 0.0201717 0.0061331 -0.056781 0.0692094 0.036389 0.0183102 -0.0510915 0.0118511 -0.0230675 -0.0751576 -0.0784196 -0.0866995 -0.0971895 0.0363947 -0.0182955 -0.0511112 -0.011834 -0.0230706 0.0751438 -0.0784435 0.0866811 -0.0971932 0.0363969 -0.0182953 -0.051113 -0.011835 -0.0230722 0.0751443 -0.0784423 0.0866793 -0.0971931 0.036394 0.0183159 -0.0510792 0.0118515 -0.0230673 -0.075161 -0.078412 -0.0867029 -0.0971897 -0.1797905 -0.0000364 -0.0261384 -0.0000352 0.1008483 -0.0000019 -0.0679663 -0.0000093 0.0412159 0.0543253 -0.0000073 -0.0391187 -0.0000083 0.1081484 -0.0000031 0.0406798 0.0000075 -0.1244375 -0.1797881 -0.0000366 -0.0261433 -0.0000359 0.1008486 -0.0000004 -0.0679734 -0.0000084 0.0412133 0.054326 -0.0000102 -0.0391136 -0.000011 0.1081478 0.000001 0.0406853 0.0000102 -0.1244364 0.0329503 0.0262775 -0.0183016 0.0167158 0.0580403 -0.1025069 -0.0228876 -0.0494391 -0.1293446 -0.0408777 -0.0764446 0.0157798 -0.0820088 -0.2089906 0.0446696 0.0003506 0.0219062 0.0738567 -0.0409041 0.0764773 0.0157858 0.0820483 -0.2089628 -0.0446553 0.0003548 -0.0218923 0.07386 0.0329602 -0.0262821 -0.0183266 -0.0167185 0.0580366 0.1024931 -0.0228995 0.0494226 -0.1293561 0.0329584 -0.0262851 -0.0183249 -0.0167229 0.0580417 0.1024892 -0.0228975 0.0494197 -0.1293586 -0.0409083 0.0764804 0.015782 0.082051 -0.2089606 -0.0446486 0.000349 -0.0218831 0.0738608 -0.0408764 -0.0764404 0.0157901 -0.0820059 -0.2089909 0.0446912 0.0003618 0.0219355 0.0738533 0.032952 0.0262735 -0.0183028 0.0167109 0.058029 -0.1025223 -0.0228886 -0.0494587 -0.1293329 unknown
polarizability: 114.0670996|0.0013802|100.5670773|-3.0219855|-0.0007255|83.4663553 unknown
InChI: InChI=1S/C10H16/c1-2-8-6-10(8)4-3-9-5-7(1)9/h7-10H,1-6H2
charge 0 multiplicity 1
26 atoms
C  1.738278 0.771092 0.409694
C  1.738497 -0.77074 0.409693
C  -1.738482 0.770678 -0.409744
C  -1.738269 -0.771156 -0.40974
C  2.853875 0.000328 -0.321861
C  -2.853875 -0.000382 0.32179
C  0.702269 1.606567 -0.342629
C  0.702664 -1.606479 -0.34257
C  -0.702671 1.606438 0.342537
C  -0.702255 -1.60658 0.342624
H  2.034884 1.223228 1.366762
H  2.035227 -1.222784 1.366768
H  -2.035206 1.22272 -1.366821
H  -2.034824 -1.223317 -1.366813
H  3.864308 0.000463 0.099611
H  2.826667 0.000329 -1.418009
H  -3.864297 -0.000516 -0.099709
H  -2.826695 -0.000395 1.417939
H  0.600128 1.238803 -1.382265
H  1.090456 2.641834 -0.419759
H  1.091056 -2.641674 -0.419652
H  0.60044 -1.238802 -1.382226
H  -0.600459 1.238784 1.382202
H  -1.091079 2.641628 0.419585
H  -1.090431 -2.641842 0.419863
H  -0.600104 -1.238727 1.382228
