program: Gaussian 09
title: 000136121
version: EM64L-G09RevD.01
frameworkgroup: C1[X(C5H9N)]
method: RPBEPBE
basis: SDD
operation: Freq
keyword: #p
keyword: freq=noraman
keyword: PBEPBE/SDD
title: #p freq=noraman PBEPBE/SDD
converged: NO NO NO NO
title: Mulliken charges:
elementType: N C C C C C H H H H H H H H H
charge: -0.118567 -0.147331 -0.433879 -0.465793 -0.420499 -0.424131 0.241541 0.233855 0.210463 0.232724 0.211851 0.196270 0.243620 0.215318 0.224558
chargesum: 0.00000
title: Mulliken charges with hydrogens summed into heavy atoms:
elementType: N C C C C C
charge: -0.118567 0.094210 0.010439 -0.021217 0.019390 0.015745
polarizability: 6.13119777e+01 9.39698913e-01 5.62311585e+01 2.22067123e+00 -1.48777596e+00 4.88369946e+01
1716.lowfreq: -19.2802 -0.0010 -0.0007 -0.0006 18.5046 25.1741 130.4060 305.0448 430.9785
frequency: 130.3682 305.0426 430.9756 568.9920 629.9901 710.7823 744.3792 827.4012 846.2183 875.0347 922.9586 945.8470 966.2893 1005.2645 1060.6650 1076.3444 1092.9914 1126.8879 1155.2566 1170.6491 1207.6800 1229.8733 1273.0782 1293.5480 1300.4433 1333.8714 1455.0207 1464.3132 1473.9399 1485.9077 2972.0378 2997.7862 3004.4291 3041.8874 3057.5500 3065.3657 3079.6476 3124.4944 3156.2024
redmass: 1.7583 2.1511 2.2076 1.9301 3.7618 4.9259 4.5643 1.9679 1.3161 3.0004 2.2373 1.5720 1.7637 1.4114 1.6823 1.3839 1.4731 1.6570 1.2662 1.5089 1.5333 1.4527 1.3491 1.4382 1.2637 1.8011 1.1173 1.0995 1.0843 1.0978 1.0668 1.0594 1.0653 1.0561 1.0984 1.1000 1.1048 1.0940 1.1138
irintensity: 0.7984 1.8969 0.9505 2.8770 12.0994 3.1829 3.3410 3.7069 1.8492 2.7371 5.3795 6.0655 6.3535 1.0951 4.9283 12.7474 2.2305 3.0095 2.8337 1.3623 2.4321 6.0653 9.3102 4.6502 1.5717 0.4341 1.6433 8.8490 6.8794 8.1370 54.9130 34.6208 37.5712 32.8352 24.5004 19.8114 58.8122 24.2357 36.0610
temp: 298.150 k
press: 1.00000 atm
elementType: 7 6 6 6 6 6 1 1 1 1 1 1 1 1 1
symmnumber: 1
zpe: 344580.8 jmol-1
zpe.correction: 0.131244 hartree
zpe.thermalcorrener: 0.136586 hartree
zpe.thermalcorrenthalpy: 0.137530 hartree
zpe.thermalcorrgfe: 0.102712 hartree
zpe.sumelectzpe: -250.140750 hartree
zpe.sumelectthermal: -250.135408 hartree
zpe.sumelectthermalent: -250.134464 hartree
zpe.sumelectthermalfe: -250.169282 hartree
dipole: -1.0966 1.1121 1.3868
dipole: 2.0886
quadrupole: -36.3180 -38.1097 -37.4968
quadrupole: 1.8262 1.5149 -2.5038
quadrupole: 0.9902 -0.8015 -0.1887 1.8262 1.5149 -2.5038
hfenergy: -250.271994 hartree
pointgroup: C01 [X(C5H9N1)]
dipole: -0.4654356 0.4279227 0.5248792 debye
dipolederiv: -0.367943 -0.1413292 0.0186225 -0.1351464 -0.4799512 -0.0395491 0.0548507 -0.0872446 -0.2080469 0.1317778 0.0590875 -0.0309647 0.0429747 0.0780576 -0.0630226 -0.0648995 -0.0259298 0.1827471 0.1415032 0.017604 -0.0675379 0.048463 0.0428661 0.0334913 -0.0795961 0.0201407 0.0556953 -0.0536923 -0.0366379 0.0620711 -0.0259994 0.0014673 -0.0127639 0.0331055 0.0106551 0.1264109 0.2806283 0.133342 0.0143062 0.0794018 0.2392573 0.0031359 -0.0141147 -0.067089 0.2086937 0.0308934 0.0243835 -0.0092728 0.0434479 -0.0466224 -0.0027235 0.0419647 0.0168729 0.1512925 0.0055409 0.0026816 0.049216 -0.010817 -0.0077378 0.0907337 0.0718659 0.1268256 -0.0490527 -0.1789373 -0.0206419 -0.0086171 0.0043874 0.1198202 -0.0007809 0.0035341 -0.0060306 0.0635503 0.0337427 -0.0136252 0.0803592 -0.0369531 0.0849032 -0.0070629 -0.0123502 -0.0148448 -0.153139 0.0285183 0.0862875 -0.0419197 0.086612 -0.0850354 0.0785347 -0.0501545 0.1057031 0.0290677 0.0382374 0.0006187 -0.0335572 -0.0122458 0.0345236 -0.0452706 0.0148735 -0.1198251 -0.1395374 -0.0112491 -0.0075749 -0.0442951 0.0009906 0.0296414 0.0327015 0.0106855 0.1398339 -0.1725207 0.0128657 -0.072196 -0.0221403 -0.0744871 -0.1266044 -0.0640507 -0.0256485 -0.1039869 0.0403905 -0.1135033 -0.0234259 0.1098523 -0.0161206 0.0798295 0.0063598 0.1554119 0.018352 -0.0231213 0.0216173 -0.0085737 -0.0761226 0.0054918 0.0355848 -0.0097325 -0.1395282 -0.0134323 -0.1124299 unknown
polarizability: 61.1153006|1.3835029|56.2681802|2.3813058|-1.609417|48.9966501 unknown
InChI: InChI=1S/C5H9N/c1-2-5-4-6(5)3-1/h5H,1-4H2
charge 0 multiplicity 1
15 atoms
N  0.744625 -0.713003 -0.474064
C  0.593479 0.814147 -0.423339
C  1.575964 0.117121 0.497853
C  -0.787131 1.180345 0.150839
C  -0.522379 -1.269815 0.147792
C  -1.598216 -0.150514 0.040761
H  0.961567 1.358659 -1.299177
H  2.650774 0.128203 0.283615
H  1.321271 0.073926 1.567635
H  -1.261391 1.994217 -0.424433
H  -0.711274 1.514866 1.20253
H  -0.349614 -1.554558 1.206185
H  -0.809381 -2.176631 -0.410445
H  -2.384644 -0.240835 0.812267
H  -2.085749 -0.20083 -0.95042
