program: Gaussian 09
title: 000011724
version: EM64L-G09RevD.01
frameworkgroup: C1[X(CH3NO3)]
method: RPBEPBE
basis: SDD
operation: Freq
keyword: #pfreq=noraman
keyword: PBEPBE/SDD
title: #p freq=noraman PBEPBE/SDD
converged: NO NO NO NO
title: Mulliken charges:
elementType: O O O N C H H H
charge: -0.180521 -0.153588 -0.129728 0.205409 -0.487444 0.244321 0.250736 0.250814
chargesum: 0.00000
title: Mulliken charges with hydrogens summed into heavy atoms:
elementType: O O O N C
charge: -0.180521 -0.153588 -0.129728 0.205409 0.258428
polarizability: 4.76074393e+01 1.43888700e+00 3.46605620e+01 1.16860427e-02 3.93065378e-03 1.74658280e+01
1716.lowfreq: -12.7695 -0.0017 -0.0013 -0.0009 7.8588 8.8322 132.5698 174.3871 294.0260
frequency: 132.5517 174.3779 294.0245 490.6543 577.9953 643.8891 753.3832 925.4800 1103.6124 1120.1527 1167.9766 1407.0995 1433.3943 1462.8196 1526.4195 3001.5849 3114.8239 3132.7671
redmass: 1.9743 1.5373 4.0278 9.0363 5.9910 13.8677 13.3507 7.5780 1.2577 1.4664 11.8176 1.1509 1.0497 1.0713 10.6235 1.0276 1.1059 1.1046
irintensity: 2.2640 3.7606 3.0460 6.3137 21.4470 7.8747 140.7426 46.5500 0.1965 1.6684 196.9965 20.9967 16.5093 15.7947 227.8544 14.2788 24.3160 5.2502
temp: 298.150 k
press: 1.00000 atm
elementType: 8 8 8 7 6 1 1 1
symmnumber: 1
zpe: 134358.6 jmol-1
zpe.correction: 0.051174 hartree
zpe.thermalcorrener: 0.056484 hartree
zpe.thermalcorrenthalpy: 0.057429 hartree
zpe.thermalcorrgfe: 0.022716 hartree
zpe.sumelectzpe: -319.790337 hartree
zpe.sumelectthermal: -319.785027 hartree
zpe.sumelectthermalent: -319.784083 hartree
zpe.sumelectthermalfe: -319.818796 hartree
dipole: 3.2845 0.5105 -0.0033
dipole: 3.3239
quadrupole: -25.7281 -32.5695 -27.1821
quadrupole: -0.2052 -0.0045 0.0002
quadrupole: 2.7652 -4.0763 1.3111 -0.2052 -0.0045 0.0002
hfenergy: -319.8415118 hartree
pointgroup: C01 [X(C1H3N1O3)]
dipole: -1.2852317 -0.1957322 -0.1415314 debye
dipolederiv: -0.9979581 0.1390409 -0.0537346 0.3543314 -0.4267215 0.0145388 -0.0308467 -0.0064657 -0.2538187 -0.4308711 -0.0288839 -0.0288473 0.1152334 -0.8828887 -0.0670758 -0.0134576 -0.0800492 -0.161911 -0.9416113 -0.1962777 -0.0947063 -0.2325853 -0.4658615 -0.0556645 -0.0990396 -0.0527729 -0.1568806 1.9603205 -0.0238932 0.1578673 -0.2974601 1.4644069 0.104402 0.1287684 0.1303303 0.2459252 0.3739369 0.0312091 0.0104607 0.1706075 0.1980418 0.0056497 0.0257186 -0.0072119 0.2885025 -0.0250379 0.0699039 -0.0084251 0.0576338 0.0297476 -0.0056858 -0.0096912 -0.0045897 0.1395428 0.030722 -0.00109 -0.0140591 -0.0944674 0.0233955 0.0939318 0.0148611 0.0900971 -0.0334588 0.0304991 0.0099909 0.0314443 -0.0732933 0.0598797 -0.0900962 -0.016313 -0.069338 -0.0679014 unknown
polarizability: 47.3346215|1.2211182|34.4621464|2.8930071|1.9175165|17.9370614 unknown
InChI: InChI=1S/CH3NO3/c1-5-2(3)4/h1H3
charge 0 multiplicity 1
8 atoms
O  -0.660297 0.806386 -0.011112
O  0.426865 -1.307069 -0.13552
O  1.637933 0.61813 0.181028
N  0.591946 -0.056489 0.012127
C  -1.883536 -0.007079 -0.212802
H  -2.679219 0.754708 -0.210094
H  -2.022776 -0.72449 0.612675
H  -1.850816 -0.538998 -1.177801
