program: Gaussian 09
title: 000136106
version: EM64L-G09RevD.01
frameworkgroup: C1[X(C9H15N)]
method: RPBEPBE
basis: SDD
operation: Freq
keyword: #pfreq=noraman
keyword: PBEPBE/SDD
title: #p freq=noraman PBEPBE/SDD
converged: NO NO NO NO
title: Mulliken charges:
elementType: N C C C C C C C C C H H H H H H H H H H H H H H H
charge: 0.018585 -0.091649 -0.091251 -0.091472 -0.464969 -0.464718 -0.464772 -0.481803 -0.481527 -0.481556 0.194516 0.194517 0.194657 0.199613 0.207232 0.207045 0.199660 0.199832 0.206899 0.215145 0.215301 0.214917 0.215408 0.215179 0.215213
chargesum: 0.00000
title: Mulliken charges with hydrogens summed into heavy atoms:
elementType: N C C C C C C C C C
charge: 0.018585 0.102866 0.103266 0.103185 -0.058124 -0.058013 -0.058041 -0.051357 -0.051201 -0.051165
polarizability: 9.29892114e+01 -1.36306496e-03 9.29728457e+01 -3.26592475e-02 6.19361577e-02 8.78837968e+01
1716.lowfreq: -26.2565 -23.1385 -20.7481 -0.0004 0.0002 0.0006 301.8707 305.4394 310.5611
frequency: 301.8685 305.4086 310.5455 396.5902 397.3400 411.4822 443.5560 449.7674 573.5028 652.8654 655.3662 749.2616 757.1522 788.4813 791.7325 878.9463 879.6944 892.5090 913.0972 915.4441 924.5147 983.6723 985.3218 1021.2206 1035.2762 1037.6573 1055.1054 1091.8901 1103.8689 1105.0676 1106.1137 1132.6357 1177.3775 1177.6414 1265.8624 1266.9467 1280.2523 1287.6856 1297.4525 1297.9422 1318.0454 1318.6244 1319.6217 1338.5746 1340.2517 1347.1613 1356.3025 1356.9510 1446.8958 1448.3623 1456.1017 1460.6996 1461.5079 1478.2482 2954.5006 2956.0270 2956.3060 2964.7666 2965.5539 2969.7629 2988.7086 2989.1466 3001.1775 3011.8938 3012.2737 3019.8650 3026.4731 3034.4547 3034.9716
redmass: 1.9090 2.0024 1.9972 4.6458 4.5905 1.8392 1.6989 1.7100 3.9139 3.7307 3.7135 4.7520 3.5643 2.9330 2.9231 1.5740 1.5766 1.6434 2.1270 2.1048 2.5345 2.1577 2.1382 5.1302 2.1734 2.1620 1.6157 1.6495 1.3577 1.2149 1.1036 1.0848 1.1956 1.1943 1.8523 1.8499 1.8694 1.7625 1.5797 1.5906 1.3152 1.3103 1.3092 1.5242 1.5317 1.3142 1.5016 1.5050 1.0808 1.0803 1.0974 1.0898 1.0897 1.0920 1.0639 1.0604 1.0602 1.0603 1.0603 1.0642 1.0826 1.0826 1.0822 1.1036 1.1036 1.1026 1.1048 1.1046 1.1046
irintensity: 0.0025 0.3639 0.3697 0.2754 0.2946 0.4748 0.1452 0.1658 9.9538 0.3730 0.3538 4.9572 17.0601 0.4478 0.4090 0.0812 0.0614 0.0022 1.3557 1.3617 20.8715 13.5905 13.6176 0.1675 10.2946 10.2901 0.0030 2.8359 2.6579 1.8460 0.9329 0.0012 1.5602 1.5323 0.2582 0.2840 4.6469 0.0027 5.8883 5.9260 0.3262 0.2709 0.1165 2.6050 2.6146 0.9303 0.2418 0.2109 4.3339 3.9383 19.0118 17.1844 17.3309 2.2623 25.4817 30.3912 28.5718 17.9169 18.4622 107.5312 193.7654 192.6905 11.0105 8.9020 9.0081 95.8981 0.4253 72.7991 72.8904
temp: 298.150 k
press: 1.00000 atm
elementType: 7 6 6 6 6 6 6 6 6 6 1 1 1 1 1 1 1 1 1 1 1 1 1 1 1
symmnumber: 1
zpe: 594731.5 jmol-1
zpe.correction: 0.226521 hartree
zpe.thermalcorrener: 0.233709 hartree
zpe.thermalcorrenthalpy: 0.234653 hartree
zpe.thermalcorrgfe: 0.195577 hartree
zpe.sumelectzpe: -405.909988 hartree
zpe.sumelectthermal: -405.902800 hartree
zpe.sumelectthermalent: -405.901856 hartree
zpe.sumelectthermalfe: -405.940933 hartree
dipole: -0.0130 0.0213 -1.5016
dipole: 1.5018
quadrupole: -59.9071 -59.9118 -67.3118
quadrupole: 0.0004 -0.0574 0.1021
quadrupole: 2.4698 2.4651 -4.9349 0.0004 -0.0574 0.1021
hfenergy: -406.1365093 hartree
pointgroup: C01 [X(C9H15N1)]
dipole: -0.5908474 -0.0000772 -0.0002122 debye
dipolederiv: -0.6627828 0.0003356 -0.0004301 0.0003923 -0.4377729 -0.0000765 -0.0002389 0.0002991 -0.4382463 -0.0435566 0.0057852 -0.0140265 -0.0149988 0.0639533 -0.0175753 0.038928 -0.0177149 0.1025411 -0.043342 0.0097842 0.0114181 -0.0259434 0.077667 0.025592 -0.0327417 0.0255516 0.0881166 -0.0433274 -0.014206 0.0022304 0.041884 0.1078679 -0.0080956 -0.0064357 -0.0079424 0.0579127 0.1083646 -0.0081903 0.0013036 -0.0044449 0.1065473 -0.0181133 0.0008953 -0.0179298 -0.0077624 0.1081054 0.0049624 0.0063398 0.0030785 0.0365807 0.0586813 0.0035116 0.0586533 0.0620207 0.1080487 0.0029685 -0.0075269 0.0017373 0.0053684 -0.0405666 -0.0042142 -0.0405833 0.0940094 0.3155331 0.0070189 -0.017878 -0.0078001 0.1717719 -0.0923567 0.0198163 -0.0926209 0.3745869 0.3154673 0.0116187 0.0151844 -0.0137967 0.2436271 0.1337058 -0.0165502 0.133901 0.3025524 0.3144526 -0.0192582 0.0031521 0.0206006 0.4033897 -0.0416935 -0.0029593 -0.0417492 0.1424962 0.0148587 0.038182 -0.0986192 0.0294761 -0.0024128 0.0937593 -0.0760743 0.0937566 -0.2080707 0.0147146 0.0664338 0.0826872 0.0511705 -0.0754417 -0.1358176 0.0637295 -0.1358067 -0.1347839 0.0145683 -0.1050576 0.0162939 -0.0810718 -0.2376697 0.0420983 0.0125951 0.0420881 0.0275079 0.0509338 -0.1173202 0.0181751 -0.038717 -0.207845 0.036633 0.0060211 0.0364346 0.0241674 -0.2305908 0.0608446 -0.0096545 -0.0155785 0.0701453 -0.0057835 0.0022023 -0.005712 0.0340469 -0.2307156 -0.0380466 -0.0477043 0.0104986 0.0480469 0.0186471 0.0128147 0.0185232 0.0560825 0.0514442 0.0739845 0.0919296 0.024192 -0.0661633 -0.1190741 0.0301555 -0.1189523 -0.1181032 0.0518182 0.042472 -0.1095631 0.0138158 -0.0023334 0.0824292 -0.0357908 0.0821945 -0.1822111 -0.2309772 -0.0219275 0.0566555 0.0058707 0.0381213 -0.0127311 -0.0158205 -0.0127728 0.0662095 0.0029413 0.0548463 0.0449605 0.0970621 -0.0089748 -0.1590673 0.0649278 -0.0770877 -0.1055196 0.0025798 -0.0712527 -0.0034194 -0.1159214 -0.1700317 0.1006367 -0.0170706 0.0186198 0.0555767 0.0031262 -0.0661448 0.0250359 -0.1047641 -0.1836806 -0.023634 0.0516361 0.0584745 0.0691087 0.0025186 0.0385195 -0.0598405 0.0725358 0.050844 0.10865 -0.0915864 0.0267104 -0.1651188 0.0030384 0.0113881 -0.0699314 0.0078732 0.0205652 0.0602741 -0.1163459 0.1421297 -0.1350375 0.0027786 0.0322594 0.0632277 0.0428491 -0.0521701 -0.0865217 0.1085954 -0.1684643 -0.0620823 unknown
polarizability: 87.8828877|0.0087437|92.9882968|-0.013965|-0.0043811|92.9746694 unknown
InChI: InChI=1S/C9H15N/c1-7-2-9-3-8(1)5-10(4-7)6-9/h7-9H,1-6H2
charge 0 multiplicity 1
25 atoms
N  1.535618 -0.000929 0.00059
C  -0.517533 0.529266 -1.364793
C  -0.51915 0.917578 1.140223
C  -0.51981 -1.445643 0.224539
C  -1.038433 1.450459 -0.225308
C  -1.04058 -0.918683 -1.14246
C  -1.041469 -0.529475 1.367106
C  1.0407 0.507633 -1.314428
C  1.039247 0.883882 1.098515
C  1.038123 -1.39416 0.217189
H  -0.855874 0.910806 -2.349156
H  -0.858406 1.579335 1.962398
H  -0.860068 -2.488328 0.385902
H  -0.685788 2.490078 -0.385597
H  -2.146885 1.475753 -0.230095
H  -2.149091 -0.932417 -1.16131
H  -0.690586 -1.579017 -1.962477
H  -0.693274 -0.910566 2.349178
H  -2.150141 -0.537576 1.387637
H  1.446716 -0.14217 -2.114491
H  1.448787 1.525735 -1.470173
H  1.444838 1.90172 0.935077
H  1.446816 0.510158 2.05845
H  1.443628 -1.763499 1.179694
H  1.444814 -2.037838 -0.58751
