program: Gaussian 09
title: 000136096
version: EM64L-G09RevD.01
frameworkgroup: C1[X(C7H12S)]
method: RPBEPBE
basis: SDD
operation: Freq
keyword: #pfreq=noraman
keyword: PBEPBE/SDD
title: #p freq=noraman PBEPBE/SDD
converged: YES YES NO NO
title: Mulliken charges:
elementType: S C C C C C C C H H H H H H H H H H H H
charge: 0.157226 -0.085423 -0.084905 -0.442803 -0.435180 -0.434812 -0.731493 -0.731433 0.225543 0.225554 0.215876 0.217258 0.218005 0.218393 0.217967 0.217671 0.264818 0.251409 0.251509 0.264820
chargesum: 0.00000
title: Mulliken charges with hydrogens summed into heavy atoms:
elementType: S C C C C C C C
charge: 0.157226 0.140120 0.140649 -0.009669 0.001219 0.000825 -0.215266 -0.215105
polarizability: 8.42107496e+01 1.87399278e-02 9.03001087e+01 2.42851526e+00 -8.99407459e-03 7.58504019e+01
1716.lowfreq: -35.0423 -18.4026 -8.0621 -0.0015 0.0009 0.0015 133.3559 149.9266 286.0065
frequency: 132.9891 149.8987 286.0039 317.4597 391.1023 404.8197 449.0310 599.5748 624.4875 730.0416 749.3397 772.0417 823.4520 827.9666 862.9300 868.9386 903.5950 975.0242 998.2200 999.6910 1018.0377 1049.2184 1082.7545 1106.3179 1141.5603 1151.7756 1171.2273 1195.7290 1225.3378 1254.4278 1257.3824 1272.0688 1287.0414 1313.7311 1314.5237 1324.1145 1334.4303 1440.2513 1443.0587 1451.6328 1460.6109 1475.0613 2979.8371 2983.4687 2994.4087 2996.8226 3006.7767 3011.3730 3021.0865 3051.0319 3051.3714 3074.3062 3079.1160 3080.1789
redmass: 1.9092 3.3835 3.2227 1.8763 2.0456 3.8827 2.3772 5.4391 6.5590 4.2660 1.3504 3.8241 2.4288 2.7466 1.6038 2.1542 1.9259 1.8845 1.9274 2.2647 2.1653 1.3593 1.6287 1.0693 1.0706 1.1057 1.0754 1.3526 1.5598 1.5951 1.2869 1.4804 1.3238 1.4891 1.4483 1.5965 1.4930 1.0882 1.0849 1.0824 1.0891 1.0976 1.0689 1.0735 1.0658 1.0659 1.0599 1.0633 1.0735 1.1018 1.1047 1.1047 1.1062 1.1059
irintensity: 0.1780 2.7437 0.1282 0.3488 0.6350 0.5317 0.0587 4.2778 1.0484 1.2861 6.2713 0.8568 6.4596 2.3692 0.0001 0.5569 4.8585 1.8817 0.1001 7.7639 5.8768 0.0294 1.2352 0.7742 0.0498 0.2401 0.5330 1.7222 5.4501 1.0357 10.5003 0.6062 0.6437 4.9538 3.1799 1.5606 1.4748 1.6017 11.0642 9.1123 26.5597 2.7159 4.4863 1.2070 45.7248 34.8610 85.8956 123.6191 21.1418 0.7421 27.0845 51.5906 6.7493 39.0118
temp: 298.150 k
press: 1.00000 atm
elementType: 16 6 6 6 6 6 6 6 1 1 1 1 1 1 1 1 1 1 1 1
symmnumber: 1
zpe: 460363.0 jmol-1
zpe.correction: 0.175343 hartree
zpe.thermalcorrener: 0.182570 hartree
zpe.thermalcorrenthalpy: 0.183514 hartree
zpe.thermalcorrgfe: 0.143866 hartree
zpe.sumelectzpe: -671.363668 hartree
zpe.sumelectthermal: -671.356442 hartree
zpe.sumelectthermalent: -671.355497 hartree
zpe.sumelectthermalfe: -671.395145 hartree
dipole: 1.8966 -0.0004 1.0412
dipole: 2.1636
quadrupole: -61.1504 -53.0816 -57.4040
quadrupole: 0.0079 -1.0001 -0.0015
quadrupole: -3.9384 4.1304 -0.1920 0.0079 -1.0001 -0.0015
hfenergy: -671.5390112 hartree
pointgroup: C01 [X(C7H12S1)]
dipole: 0.4958195 0.0491143 -0.6901908 debye
dipolederiv: -0.2519565 -0.0010617 0.0156302 -0.0018269 -0.2409954 0.0074583 -0.0046259 0.0041819 -0.0954046 0.0839638 0.0182522 -0.0134555 -0.0221908 0.0260455 0.0408882 0.0076916 0.0169531 0.0392931 0.0779875 -0.0021765 -0.0001422 0.0397471 0.0279096 -0.0419655 0.0107387 -0.0133847 0.0429624 0.0854556 0.0175942 -0.048208 0.0190659 -0.0410452 -0.0037773 -0.0017959 0.0030877 0.048769 0.0328215 0.0612672 -0.0646887 0.0631556 0.0414687 -0.0210927 -0.0891114 -0.0029342 0.0531291 0.0704326 -0.0571761 -0.0636337 -0.0603542 0.005155 0.0034562 -0.0826223 -0.0206037 0.0540583 0.0802733 0.0110513 0.0274722 0.0707182 0.2562655 -0.1751341 0.0324865 -0.1204278 0.1107319 0.1183128 -0.0559075 -0.0209398 -0.115037 0.2385865 0.1652355 0.002982 0.1152687 0.0906273 0.0145331 -0.0534368 0.0494905 0.0009763 -0.1423929 0.105747 0.0259158 0.1348075 -0.0111395 -0.0147361 0.0990825 0.0714219 0.0435975 -0.1283424 -0.0782173 0.0611241 -0.1122601 0.0041966 -0.089734 -0.02645 -0.1738223 -0.023986 0.0419786 -0.0285553 -0.1046098 -0.0182177 -0.0278783 -0.0889763 -0.0146505 0.170212 -0.0164237 0.0476845 0.0224234 0.1164605 0.0145722 -0.029014 0.0796948 0.0510973 0.0533871 0.0231791 0.0173808 -0.0608247 0.0046979 -0.1027698 -0.1075871 -0.1332448 -0.1145161 0.0339612 -0.0921631 -0.0218949 0.0210087 0.0861421 0.0680423 0.0573648 -0.1825281 0.0677256 0.0330226 0.048882 0.0234488 -0.0075168 0.0981769 -0.0371001 0.060966 0.0946523 -0.025178 0.0355705 -0.0009314 0.012809 0.0661506 -0.0248109 0.0916048 -0.1190852 0.0775111 -0.0007935 0.0247985 0.0418519 -0.1011651 -0.0660265 0.0449265 -0.0713488 -0.0018457 -0.067184 0.0133899 -0.0755097 -0.0221053 0.0212264 0.0448179 -0.1206497 0.0992458 -0.08512 -0.0607983 -0.041542 -0.0564049 -0.0083233 0.0026507 -0.0706 -0.0855961 -0.1363086 -0.0727638 0.0735199 0.0534284 0.0018382 0.0121682 -0.0867736 0.0765245 0.0224792 0.0875914 -0.0122604 unknown
polarizability: 81.0395394|-1.5573063|90.0281448|-4.6641633|-1.0806117|79.293576 unknown
InChI: InChI=1S/C7H12S/c1-2-7-3-6(1)4-8-5-7/h6-7H,1-5H2
charge 0 multiplicity 1
20 atoms
S  -1.474348 -0.153569 1.352562
C  0.236262 1.26207 -0.475263
C  0.593923 -1.131253 -0.39096
C  0.358331 0.022571 -1.40322
C  1.385861 1.03889 0.557396
C  1.619533 -0.511469 0.60965
C  -1.159616 1.312255 0.184749
C  -0.733005 -1.540585 0.285181
H  0.374703 2.206095 -1.038749
H  1.006581 -2.031004 -0.888917
H  -0.533962 -0.132932 -2.03851
H  1.23705 0.129901 -2.067269
H  1.11343 1.438941 1.55006
H  2.300796 1.562639 0.223224
H  2.650142 -0.762888 0.296498
H  1.473151 -0.908174 1.62988
H  -1.269171 2.199692 0.832329
H  -1.955662 1.330092 -0.581121
H  -1.482698 -1.840633 -0.468825
H  -0.586701 -2.375739 0.992103
