program: Gaussian 09
title: 000136093
version: EM64L-G09RevD.01
frameworkgroup: C1[X(C6H11N)]
method: RPBEPBE
basis: SDD
operation: Freq
keyword: #pfreq=noraman
keyword: PBEPBE/SDD
title: #p freq=noraman PBEPBE/SDD
converged: NO YES NO NO
title: Mulliken charges:
elementType: N C C C C C C H H H H H H H H H H H
charge: -0.283199 -0.190913 -0.191027 -0.458505 -0.425690 -0.458314 -0.425784 0.240512 0.240506 0.223781 0.205265 0.190794 0.233806 0.205251 0.223811 0.233828 0.190809 0.245070
chargesum: 0.00000
title: Mulliken charges with hydrogens summed into heavy atoms:
elementType: N C C C C C C
charge: -0.038130 0.049599 0.049479 -0.029460 -0.001090 -0.029252 -0.001147
polarizability: 6.67777169e+01 7.94607034e-04 6.65231772e+01 -1.00217526e+00 1.53789829e-04 6.14359596e+01
1716.lowfreq: -0.0011 -0.0010 -0.0009 32.8387 39.4606 43.0338 157.8343 320.4620 393.5383
frequency: 157.3177 320.4564 393.5369 506.5751 556.3129 749.9346 763.2627 774.1173 800.7992 814.3506 859.0490 885.3473 897.1991 924.7792 959.3501 987.4603 989.1338 1007.7585 1020.5658 1076.5489 1103.7067 1144.9116 1162.6722 1187.5153 1194.2909 1211.8129 1243.9480 1257.9353 1260.4344 1286.5248 1298.3824 1322.3831 1358.8081 1453.8755 1468.7625 1469.3092 1488.2000 2989.7179 3005.8565 3010.7797 3025.1386 3049.0917 3067.1114 3071.8944 3077.0565 3083.5637 3094.3365 3368.0729
redmass: 1.7711 1.5981 2.2619 2.2770 3.8856 3.8167 1.7004 4.0728 1.4647 2.5810 1.5774 3.0647 2.8582 1.8194 2.3300 1.7716 2.0015 2.5211 1.5356 1.6789 1.1067 1.1212 1.3608 1.5642 1.1774 1.3403 1.3296 1.5245 1.3355 1.3907 1.4201 1.6191 1.4714 1.0819 1.0845 1.0968 1.0969 1.0597 1.0626 1.0586 1.0621 1.1034 1.1024 1.1047 1.0910 1.0944 1.1040 1.0746
irintensity: 0.0502 0.1296 0.0588 27.1286 1.5808 21.4811 60.9261 1.5682 11.3528 2.3518 53.7272 7.4066 9.6955 0.3855 2.1326 0.0515 4.4695 4.3331 8.0872 5.7727 1.7100 1.6415 1.6800 22.8752 0.8459 8.1735 0.1568 3.2980 0.3687 3.6415 0.1038 2.3149 10.9726 0.3781 4.9218 12.3769 5.0945 33.4706 62.8651 32.6323 50.5502 5.2336 15.3560 57.1566 70.8700 1.1864 77.3464 7.8327
temp: 298.150 k
press: 1.00000 atm
elementType: 7 6 6 6 6 6 6 1 1 1 1 1 1 1 1 1 1 1
symmnumber: 1
zpe: 425870.3 jmol-1
zpe.correction: 0.162205 hartree
zpe.thermalcorrener: 0.167869 hartree
zpe.thermalcorrenthalpy: 0.168813 hartree
zpe.thermalcorrgfe: 0.133099 hartree
zpe.sumelectzpe: -289.405546 hartree
zpe.sumelectthermal: -289.399883 hartree
zpe.sumelectthermalent: -289.398939 hartree
zpe.sumelectthermalfe: -289.434653 hartree
dipole: -1.1919 0.0003 -0.8466
dipole: 1.4620
quadrupole: -43.6005 -42.3268 -45.1100
quadrupole: 0.0003 -3.2821 0.0013
quadrupole: 0.0786 1.3523 -1.4309 0.0003 -3.2821 0.0013
hfenergy: -289.5677516 hartree
pointgroup: C01 [X(C6H11N1)]
dipole: 0.4758904 0.0005824 0.32306 debye
dipolederiv: -0.3342974 0.0000277 -0.2672726 0.0000607 -0.3664901 -0.0003987 -0.1967167 -0.0002849 -0.6716618 0.2823117 0.0818855 0.0598871 0.0124242 0.2615712 -0.0320708 0.0846464 -0.062314 0.3030726 0.2824487 -0.0818549 0.0598091 -0.0122804 0.2614245 0.0322859 0.0844201 0.0625798 0.3031045 -0.0374786 -0.0609473 -0.1261734 -0.0693906 -0.0250927 -0.0281371 -0.0980739 0.0304207 0.0273449 0.0133417 0.0662893 0.076921 0.0561753 0.0203356 -0.038316 0.0531404 -0.0157311 0.0973901 -0.03784 0.0609157 -0.1264855 0.0693754 -0.0247745 0.0277587 -0.0981727 -0.030685 0.0270644 0.013675 -0.0662321 0.0767684 -0.0561453 0.0200626 0.0385966 0.0532034 0.0158909 0.0974052 0.039588 0.0037265 -0.0014645 0.0016678 -0.152541 -0.0826764 0.0004166 -0.1028437 0.015029 0.0395883 -0.0033208 -0.0016611 -0.0012258 -0.1524792 0.0827496 0.0001923 0.1029075 0.0149546 -0.1333054 0.0938313 0.0667701 0.0719421 0.0047961 -0.0215591 0.1082328 -0.0579447 0.026415 0.0674572 0.0002813 0.0049364 0.0083105 0.0121402 0.0770801 -0.0343099 0.1281497 -0.151719 0.0699783 0.0180064 -0.0255663 -0.0113669 -0.0007081 0.0831194 0.0222955 0.1188162 -0.142187 -0.1242445 -0.0913994 -0.0570215 -0.07075 0.0109257 -0.0168826 -0.0931099 -0.0541736 0.0459954 0.0675121 -0.0000166 0.0054424 -0.0080902 0.0121403 -0.0770122 -0.0337277 -0.1281973 -0.1517527 -0.1329772 -0.0942864 0.0665553 -0.0724726 0.0043137 0.0216585 0.1078408 0.0581339 0.0266513 -0.1246035 0.0909869 -0.0572016 0.0702657 0.0114421 0.0167794 -0.0934146 0.053997 0.0458794 0.0699901 -0.0177985 -0.0252271 0.0116109 -0.0008539 -0.0833022 0.0226947 -0.118865 -0.1420434 -0.0211447 -0.0000946 0.2709838 -0.0001108 0.1037876 0.000327 0.1104424 0.0001438 0.2290577 unknown
polarizability: 66.7328555|-0.0007155|66.5231756|-1.1144444|-0.0016471|61.4808225 unknown
InChI: InChI=1S/C6H11N/c1-2-6-4-3-5(1)7-6/h5-7H,1-4H2
charge 0 multiplicity 1
18 atoms
N  -0.064482 -0.000312 -1.353861
C  0.00544 -1.115142 -0.339947
C  0.002751 1.115047 -0.340381
C  1.284242 -0.78626 0.50939
C  -1.255795 -0.788946 0.509251
C  1.282127 0.789513 0.509524
C  -1.257843 0.786212 0.50871
H  0.001691 -2.115653 -0.799549
H  -0.00317 2.115359 -0.800389
H  2.192036 -1.18856 0.021723
H  1.235418 -1.212576 1.527211
H  -1.190174 -1.220957 1.52339
H  -2.162497 -1.185756 0.022239
H  1.231143 1.215382 1.527428
H  2.189201 1.194563 0.02283
H  -2.165401 1.180199 0.020994
H  -1.193815 1.21916 1.52255
H  0.759627 0.000529 -1.981611
