program: Gaussian 09
title: 000136084
version: EM64L-G09RevD.01
frameworkgroup: C1[X(C5H4N4)]
method: RPBEPBE
basis: SDD
operation: Freq
keyword: #p
keyword: freq=noraman
keyword: PBEPBE/SDD
title: #p freq=noraman PBEPBE/SDD
converged: NO NO NO NO
title: Mulliken charges:
elementType: N N N N C C C C C H H H H
charge: -0.038913 -0.030760 -0.340445 -0.016574 0.130809 0.033776 -0.219665 -0.344049 -0.304364 0.252842 0.261920 0.366228 0.249196
chargesum: 0.00000
title: Mulliken charges with hydrogens summed into heavy atoms:
elementType: N N N N C C C C C
charge: -0.038913 -0.030760 0.025783 -0.016574 0.130809 0.033776 0.033177 -0.082129 -0.055169
polarizability: 1.06511330e+02 -1.42715581e+00 8.43795834e+01 -9.27324832e-04 7.08475869e-04 3.23728644e+01
1716.lowfreq: -0.0005 -0.0004 0.0006 6.1082 8.9283 10.8158 214.2154 247.3956 401.6829
frequency: 214.2150 247.3899 401.6823 418.3916 541.2286 601.1275 621.2827 629.8721 745.7856 778.9372 788.0905 829.7706 867.9904 918.5147 925.9904 962.0015 998.1386 1096.7032 1103.3170 1169.8479 1215.9794 1255.9054 1318.6205 1359.5573 1420.5494 1425.3767 1443.4377 1529.5197 1594.4262 3144.8323 3150.7016 3180.2176 3601.5366
redmass: 4.9317 6.2402 6.0506 2.7326 9.1768 4.6402 7.5758 12.1933 1.1185 5.5810 4.7570 1.4012 6.5786 1.4692 10.7355 1.3983 2.4247 6.5074 6.3897 1.8890 3.4754 2.9948 1.5134 3.9609 2.6478 1.3885 3.0891 6.8568 8.2888 1.0912 1.0905 1.0982 1.0836
irintensity: 0.7441 1.0752 3.5115 12.7418 0.2798 9.0886 4.0808 0.2000 99.4245 6.6186 1.7257 66.9263 16.4979 3.1260 4.9492 0.0305 1.7643 29.6011 24.7263 1.2337 4.9255 1.0272 1.6256 16.3628 0.5180 26.6532 2.0356 3.2615 16.7720 12.4956 5.7652 12.5398 139.6124
temp: 298.150 k
press: 1.00000 atm
elementType: 7 7 7 7 6 6 6 6 6 1 1 1 1
symmnumber: 1
zpe: 242249.4 jmol-1
zpe.correction: 0.092268 hartree
zpe.thermalcorrener: 0.098093 hartree
zpe.thermalcorrenthalpy: 0.099038 hartree
zpe.thermalcorrgfe: 0.062120 hartree
zpe.sumelectzpe: -411.266802 hartree
zpe.sumelectthermal: -411.260976 hartree
zpe.sumelectthermalent: -411.260032 hartree
zpe.sumelectthermalfe: -411.296949 hartree
dipole: 2.0270 1.1324 0.0000
dipole: 2.3219
quadrupole: -46.6448 -52.4222 -53.0262
quadrupole: -4.8026 0.0001 0.0000
quadrupole: 4.0529 -1.7245 -2.3285 -4.8026 0.0001 0.0000
hfenergy: -411.3590697 hartree
pointgroup: C01 [X(C5H4N4)]
dipole: -0.8083623 0.4254738 -0.0000117 debye
dipolederiv: -0.1089482 -0.1910465 0.0000009 0.2369934 -0.3386638 0.0000092 0.00001 -0.0000004 -0.1389411 -0.0048142 0.0928303 -0.0000043 -0.2136419 -0.3591444 -0.0000021 0.0000172 0.0000115 -0.1214855 -0.51686 0.0116983 0.0000095 -0.0095206 0.4802591 -0.0000118 -0.0000329 -0.0000124 -0.1955744 -0.4503811 -0.0499188 0.0000044 -0.1220743 -0.2566645 0.0000006 0.0000038 0.000004 -0.252347 0.1838705 0.1438815 -0.0000056 0.0426413 -0.0549188 -0.0000004 -0.0000007 0. 0.0604985 -0.0894735 0.050147 -0.0000026 0.0232477 -0.1872478 0.0000047 0.0000021 0.0000027 0.0982665 -0.090451 -0.057566 0.0000021 0.0686268 0.0759484 -0.0000025 -0.0000034 0.0000009 -0.1096337 0.360077 -0.1284766 -0.0000032 -0.0466545 0.3366211 -0.0000052 -0.0000063 -0.000011 -0.0421321 0.2302904 0.2336337 -0.0000073 0.1262587 0.1687948 -0.0000033 -0.0000013 -0.0000076 -0.1070752 0.0910294 0.0165193 0.000001 -0.0354962 -0.0509731 0.0000029 -0.0000005 0.0000022 0.1730344 0.0813327 -0.0115142 0.000001 0.0009176 -0.0616938 0.000003 -0.0000003 0.0000065 0.1391779 0.3550223 0.0012538 0.0000006 0.0075157 0.2184447 0.0000023 0.0000097 0.0000019 0.3409251 -0.0406941 -0.1114417 0.0000034 -0.0788138 0.0292379 0.0000024 0.0000027 0.0000017 0.1552867 unknown
polarizability: 106.426268|1.9779073|84.4646457|-0.0009093|-0.0007314|32.3728644 unknown
InChI: InChI=1S/C5H4N4/c1-2-6-3-5-4(1)7-9-8-5/h1-3,9H
charge 0 multiplicity 1
13 atoms
N  -1.633424 1.157658 0.000041
N  -1.581358 -1.204834 0.000083
N  -2.303035 -0.041575 0.00004
N  2.130012 -0.696503 0.000008
C  -0.311963 0.731409 0.000021
C  -0.280491 -0.717572 0.000041
C  0.909063 1.460033 -0.000003
C  0.975784 -1.392797 0.000029
C  2.082001 0.695059 -0.00001
H  0.936406 2.552946 -0.000013
H  1.044325 -2.486116 0.00005
H  -3.322912 -0.06391 0.000038
H  3.060892 1.185401 -0.000024
