program: Gaussian 09
title: 000136074
version: EM64L-G09RevD.01
frameworkgroup: C1[X(C14H10S)]
method: RPBEPBE
basis: SDD
operation: Freq
keyword: #pfreq=noraman
keyword: PBEPBE/SDD
title: #p freq=noraman PBEPBE/SDD
converged: YES YES NO NO
title: Mulliken charges:
elementType: S C C C C C C C C C C C C C C H H H H H H H H H H
charge: 0.221108 0.485722 0.485721 -0.355390 -0.355390 -0.299204 -0.299204 -0.382777 -0.382778 -0.247771 -0.247771 -0.246125 -0.246126 -0.232954 -0.232953 0.208910 0.208910 0.237877 0.237877 0.255905 0.255905 0.231787 0.231787 0.233467 0.233468
chargesum: 0.00000
title: Mulliken charges with hydrogens summed into heavy atoms:
elementType: S C C C C C C C C C C C C C C
charge: 0.221108 0.485722 0.485721 -0.355390 -0.355390 -0.090294 -0.090294 -0.144900 -0.144901 0.008134 0.008135 -0.014338 -0.014339 0.000514 0.000514
polarizability: 2.62210049e+02 -6.58623704e-05 1.63917936e+02 -7.79584250e-06 4.38892659e+00 8.89237327e+01
1716.lowfreq: -12.7684 -8.0027 -4.2136 -0.0021 -0.0020 -0.0012 47.1786 91.3576 137.3605
frequency: 47.1712 91.3554 137.3564 181.6514 238.7027 268.4103 280.2378 299.2125 383.1733 399.3293 417.7408 461.5691 464.7435 522.8575 542.5081 545.6857 580.2172 654.9977 658.1737 703.5857 710.4426 742.9063 754.1961 774.3484 777.2672 806.1024 861.9388 883.0389 886.7114 952.6900 955.0641 981.7561 988.2063 990.5600 1020.4022 1030.3562 1042.6485 1044.4224 1123.9825 1125.5840 1165.5760 1172.8806 1173.0931 1221.0278 1242.0463 1256.9469 1291.9010 1370.1666 1380.1972 1404.1451 1415.2722 1439.9691 1466.6686 1469.3247 1563.9710 1565.0768 1593.2145 1595.0786 1635.7796 3080.8346 3108.2976 3122.9653 3123.3574 3137.3715 3137.5510 3151.4607 3151.7662 3167.8404 3168.1841
redmass: 5.7416 3.9738 4.1763 5.1013 4.2225 6.8078 5.0585 5.5606 3.4686 10.8282 4.7885 3.5704 3.1972 5.1768 5.8994 4.7907 3.2592 6.4539 6.2636 5.1493 2.2466 1.9663 1.4747 1.8884 4.1604 1.6921 2.1304 1.4752 2.1075 1.3886 1.3933 1.3160 1.3375 1.3258 7.2157 3.8706 2.1645 3.3275 1.7335 1.5997 2.3175 1.0610 1.0657 2.0726 1.4028 1.4484 1.3395 7.5561 4.6147 1.7634 2.1028 1.7373 2.3489 2.9457 5.8872 6.3499 6.3345 6.6345 7.6314 1.0833 1.0936 1.0870 1.0869 1.0884 1.0884 1.0940 1.0941 1.1007 1.1007
irintensity: 0.6926 0.0001 0.4475 0.0304 5.2244 2.3434 0.0289 2.2150 0.6456 0.9768 1.6635 2.8600 25.7469 2.2341 1.2062 4.0821 0.0121 7.3986 0.1681 0.2520 0.2043 8.1815 61.0265 32.4822 19.3528 76.1902 7.4344 6.7073 2.6863 0.9541 5.4017 1.8212 0.1058 0.0959 35.5890 4.0322 0.0060 3.5523 4.7471 0.0237 0.9472 0.0114 0.0907 5.4179 1.5598 0.0002 6.1294 1.2846 4.6601 1.9107 14.8266 21.6157 3.5183 33.0903 7.1258 0.0560 2.5902 0.0881 0.3057 0.2872 31.6195 0.1223 13.8105 0.1495 13.3529 14.3692 24.1068 51.2958 9.2463
temp: 298.150 k
press: 1.00000 atm
elementType: 16 6 6 6 6 6 6 6 6 6 6 6 6 6 6 1 1 1 1 1 1 1 1 1 1
symmnumber: 1
zpe: 503049.3 jmol-1
zpe.correction: 0.191601 hartree
zpe.thermalcorrener: 0.202963 hartree
zpe.thermalcorrenthalpy: 0.203907 hartree
zpe.thermalcorrgfe: 0.153994 hartree
zpe.sumelectzpe: -936.525005 hartree
zpe.sumelectthermal: -936.513644 hartree
zpe.sumelectthermalent: -936.512699 hartree
zpe.sumelectthermalfe: -936.562613 hartree
dipole: 0.0000 1.0589 -1.4806
dipole: 1.8203
quadrupole: -78.7670 -82.4510 -100.3944
quadrupole: 0.0000 0.0000 2.5992
quadrupole: 8.4371 4.7531 -13.1903 0.0000 0.0000 2.5992
hfenergy: -936.7166068 hartree
pointgroup: C01 [X(C14H10S1)]
dipole: -0.0000168 -0.3486365 -0.6255849 debye
dipolederiv: -0.3410193 0.0000086 0.0000073 0.0000093 0.0075603 0.1300681 0.0000028 0.0455283 0.0153077 0.0512968 -0.1234597 -0.0643109 -0.1831703 -0.0537159 -0.0121963 -0.1770574 -0.0055097 -0.0406838 0.0513202 0.1234556 0.0643079 0.1831664 -0.05373 -0.0122034 0.1770567 -0.0055198 -0.0406904 0.3996048 0.130666 0.273934 0.2301083 -0.0449808 -0.0315446 0.2954631 0.0083038 -0.0105966 0.3995718 -0.1306869 -0.273946 -0.2301279 -0.0449639 -0.0315268 -0.2954733 0.0083193 -0.0105822 0.0207672 0.009972 0.029431 -0.1420728 0.1458959 -0.0817327 0.1768426 -0.0880786 -0.1305925 0.0207699 -0.0099691 -0.0294387 0.1420759 0.1458899 -0.0817358 -0.1768489 -0.0880706 -0.1305865 -0.0953731 0.0343137 0.0664633 0.0846124 0.08632 0.0203374 -0.0028079 0.0603929 -0.1246402 -0.0953829 -0.0343046 -0.0664632 -0.0846045 0.0863258 0.0203416 0.002809 0.0603914 -0.1246389 -0.3323463 0.0422895 -0.0213253 -0.0672435 0.0609569 0.0120866 -0.1071306 0.032526 -0.1172995 -0.3323421 -0.0422705 0.021332 0.0672607 0.0609547 0.0120831 0.1071386 0.0325217 -0.1173039 0.0490436 0.0409809 0.0971276 0.0233581 -0.046521 0.0343832 0.1349239 0.0268951 -0.1066802 0.0490354 -0.0409853 -0.0971293 -0.0233614 -0.0465172 0.0343878 -0.1349266 0.0269027 -0.1066748 -0.0235477 -0.0818151 0.0628607 0.055393 0.0237725 -0.0084134 0.1051882 -0.0214086 -0.1072246 -0.0235514 0.0818173 -0.0628639 -0.0553924 0.0237717 -0.0084107 -0.1051919 -0.0214076 -0.1072192 0.0008861 -0.097112 0.0091766 -0.0313851 -0.0940168 0.0594162 -0.0030224 0.0289181 0.1299307 0.0008918 0.0971088 -0.0091708 0.0313821 -0.0940235 0.0594163 0.0030259 0.0289164 0.1299304 0.0874803 -0.0009556 -0.0376872 -0.0557233 -0.1016109 -0.0383724 -0.0226149 -0.0272383 0.1354667 0.0874839 0.0009467 0.0376868 0.0557136 -0.1016134 -0.0383744 0.0226142 -0.0272386 0.1354659 0.1170015 -0.0522142 -0.0305791 -0.0067229 -0.046212 -0.0178843 -0.0389056 -0.038049 0.1235241 0.1170064 0.0522047 0.0305783 0.0067151 -0.0462146 -0.0178848 0.038905 -0.0380511 0.1235223 -0.0819319 -0.0448964 -0.1021306 -0.0572151 0.0728192 -0.0314473 -0.121724 -0.0310253 0.1085733 -0.0819208 0.0449033 0.1021335 0.0572231 0.0728139 -0.0314535 0.1217278 -0.0310318 0.1085675 -0.0223699 0.0924336 -0.0688865 0.1099298 -0.0064846 0.0303293 -0.0831558 0.0315069 0.1325645 -0.0223741 -0.0924312 0.0688925 -0.1099286 -0.0064762 0.0303307 0.0831613 0.0315063 0.1325601 unknown
polarizability: 262.2100493|-0.0023789|163.9526939|-0.0022487|4.0810364|88.8889753 unknown
InChI: InChI=1S/C14H10S/c1-3-7-13-11(5-1)9-10-12-6-2-4-8-14(12)15-13/h1-10H
charge 0 multiplicity 1
25 atoms
S  0.000057 1.222592 1.397714
C  -1.643533 -0.762015 0.1597
C  1.643518 -0.762093 0.159658
C  -1.433115 0.627936 0.39882
C  1.433172 0.627868 0.398783
C  -0.686862 -1.83189 0.491016
C  0.686805 -1.831922 0.490998
C  -2.878323 -1.143115 -0.446551
C  2.878275 -1.143253 -0.446621
C  -2.390807 1.588356 0.005507
C  2.390894 1.588243 0.005434
C  -3.8443 -0.190584 -0.825735
C  3.844287 -0.190767 -0.825835
C  -3.599595 1.1847 -0.605523
C  3.599648 1.184528 -0.605628
H  -1.158418 -2.809944 0.665479
H  1.158319 -2.809999 0.665451
H  -3.064546 -2.208524 -0.628139
H  3.064447 -2.208671 -0.628209
H  -2.19195 2.647957 0.195487
H  2.192093 2.647854 0.195412
H  -4.781261 -0.516787 -1.289834
H  4.78122 -0.517018 -1.289956
H  -4.342737 1.935226 -0.895299
H  4.342812 1.935022 -0.895429
