program: Gaussian 09
title: 000136073
version: EM64L-G09RevD.01
frameworkgroup: C1[X(C14H10O)]
method: RPBEPBE
basis: SDD
operation: Freq
keyword: #pfreq=noraman
keyword: PBEPBE/SDD
title: #p freq=noraman PBEPBE/SDD
converged: YES YES NO NO
title: Mulliken charges:
elementType: O C C C C C C C C C C C C C C H H H H H H H H H H
charge: -0.332272 0.370745 0.370746 0.152133 0.152133 -0.293633 -0.293633 -0.385278 -0.385278 -0.359573 -0.359572 -0.262049 -0.262048 -0.221870 -0.221871 0.214665 0.214665 0.231941 0.231942 0.255502 0.255502 0.230977 0.230977 0.232574 0.232574
chargesum: 0.00000
title: Mulliken charges with hydrogens summed into heavy atoms:
elementType: O C C C C C C C C C C C C C C
charge: -0.332272 0.370745 0.370746 0.152133 0.152133 -0.078967 -0.078968 -0.153337 -0.153337 -0.104071 -0.104071 -0.031071 -0.031071 0.010704 0.010704
polarizability: 2.55835568e+02 -1.39706892e-05 1.59252377e+02 -2.30930721e-06 4.87498860e-01 6.62446866e+01
1716.lowfreq: -8.1711 -8.1102 -0.0008 -0.0006 -0.0006 1.1597 47.2657 87.0208 154.5683
frequency: 47.2102 87.0164 154.5675 207.5378 239.3000 315.8432 329.9350 330.7259 390.3034 437.3984 471.9038 487.8603 497.0358 547.7574 582.9701 598.8746 606.5634 684.3543 701.3038 711.6556 735.6818 762.1950 763.4100 800.0767 801.6587 806.2599 863.4196 875.5738 900.8953 941.6530 945.4926 976.2726 980.3030 985.9328 1033.9178 1037.0749 1082.6594 1104.9468 1152.6722 1168.1229 1168.7954 1179.1102 1182.7465 1225.0220 1245.3577 1261.4925 1286.3837 1374.8061 1384.2481 1405.8541 1427.6718 1445.2732 1475.4946 1481.2183 1569.7520 1577.7827 1606.4684 1608.6523 1645.4090 3095.9884 3121.1679 3123.5945 3125.4249 3140.0463 3140.3177 3158.1090 3158.7703 3172.6879 3173.4011
redmass: 5.6776 3.9826 4.1901 4.8385 3.7782 5.2891 5.0128 7.7648 3.4496 3.3539 4.5683 4.0854 4.1547 4.9761 3.3840 7.1923 5.0168 5.3168 5.3508 2.2883 3.3764 1.3742 1.5456 2.1738 4.4022 2.4007 1.4378 1.5474 5.1497 1.3876 1.3956 1.3171 1.3267 1.3111 2.3495 2.0665 3.0008 2.0098 1.8495 1.1490 1.0717 2.1234 3.0916 2.1518 1.4341 1.4873 1.3484 8.4273 5.8223 1.7619 2.2616 1.9364 3.0340 2.5950 5.9991 6.8510 7.0700 6.8516 7.5738 1.0840 1.0925 1.0876 1.0901 1.0887 1.0888 1.0942 1.0943 1.0998 1.0996
irintensity: 1.5514 0.0008 1.4950 0.0413 6.1803 0.6526 0.0678 1.5187 0.4441 12.0307 3.9908 0.5202 6.0793 0.5884 0.0143 1.6995 5.9448 0.0613 2.6800 2.1781 0.2351 25.9860 96.8905 86.8742 0.0348 23.9045 1.4140 2.0682 16.5849 0.6246 11.3043 0.6152 0.0243 0.2408 2.6129 7.3694 13.1195 68.0753 3.9324 0.5848 0.0584 1.5701 168.1786 5.4466 1.1482 7.9344 3.5580 1.1919 2.0321 6.0585 11.1164 75.7722 63.6813 4.7357 10.6637 4.1771 4.4041 6.0447 0.1060 0.0193 4.6200 0.0023 38.1987 0.0360 19.8856 37.2564 10.5005 28.4801 8.3823
temp: 298.150 k
press: 1.00000 atm
elementType: 8 6 6 6 6 6 6 6 6 6 6 6 6 6 6 1 1 1 1 1 1 1 1 1 1
symmnumber: 1
zpe: 509067.2 jmol-1
zpe.correction: 0.193893 hartree
zpe.thermalcorrener: 0.204721 hartree
zpe.thermalcorrenthalpy: 0.205665 hartree
zpe.thermalcorrgfe: 0.157043 hartree
zpe.sumelectzpe: -613.681278 hartree
zpe.sumelectthermal: -613.670451 hartree
zpe.sumelectthermalent: -613.669507 hartree
zpe.sumelectthermalfe: -613.718128 hartree
dipole: 0.0000 0.6558 -1.1362
dipole: 1.3119
quadrupole: -71.4915 -74.1450 -94.2250
quadrupole: 0.0000 0.0000 0.6997
quadrupole: 8.4623 5.8088 -14.2712 0.0000 0.0000 0.6997
hfenergy: -613.8751715 hartree
pointgroup: C01 [X(C14H10O1)]
dipole: 0.0000013 -0.2456166 -0.4539503 debye
dipolederiv: -1.5724142 0.0000285 -0.0000158 0.0000274 -0.2504404 0.0256002 -0.0000187 -0.0890697 -0.3402629 -0.0348385 -0.0393455 -0.0234753 -0.2532067 -0.0859517 -0.0353183 -0.151752 0.0343352 -0.0046613 -0.0348292 0.0393429 0.0234732 0.253206 -0.0859629 -0.0353121 0.1517526 0.0343301 -0.0046565 1.0333425 0.0822477 0.2248765 0.2728148 0.1165544 -0.0165746 0.399969 0.0301839 0.156121 1.0333424 -0.0822864 -0.2248541 -0.2728536 0.1165684 -0.0165723 -0.3999442 0.0301985 0.1561044 0.032769 -0.0268986 0.017835 -0.217232 0.1563149 -0.044979 0.142055 -0.0523089 -0.1512274 0.0327816 0.0269053 -0.0178316 0.2172377 0.1563042 -0.0449731 -0.1420524 -0.0523029 -0.1512319 0.0022976 -0.0022572 0.0610811 0.0978431 0.1154716 0.0291039 0.0212527 0.037218 -0.1385286 0.0022937 0.0022607 -0.0610763 -0.0978387 0.1154747 0.0291034 -0.0212479 0.037219 -0.138531 -0.3575165 0.0130879 0.0088716 0.0997593 0.0369678 0.0716386 -0.0516407 0.0240293 -0.1359562 -0.3575212 -0.0130725 -0.0088746 -0.0997443 0.0369727 0.0716359 0.0516358 0.024026 -0.135955 0.0603191 0.033857 0.0696961 0.0771501 -0.1325731 0.0255727 0.1029484 0.0130282 -0.1478529 0.0603197 -0.0338652 -0.0696896 -0.0771587 -0.1325674 0.0255736 -0.1029416 0.0130316 -0.1478574 0.0022141 -0.0143715 0.0530357 0.0207481 0.078163 -0.0017731 0.0790783 0.0150275 -0.1369724 0.0022167 0.0143743 -0.0530326 -0.0207452 0.0781623 -0.001772 -0.0790748 0.0150304 -0.136976 0.000566 -0.1071744 0.0017422 -0.0262771 -0.0858511 0.0316954 -0.0001853 0.0099616 0.1413546 0.0005717 0.1071701 -0.0017448 0.0262724 -0.0858567 0.0316964 0.000182 0.0099649 0.1413546 0.0832912 -0.0134547 -0.0241343 -0.0696048 -0.0987741 -0.0334142 -0.0176328 -0.028228 0.1431401 0.0832939 0.0134475 0.0241313 0.0695977 -0.0987771 -0.0334131 0.0176301 -0.0282284 0.1431415 0.0964764 -0.0664537 -0.0330235 -0.0260827 -0.0332319 -0.0311969 -0.04087 -0.03222 0.1494059 0.0964785 0.0664494 0.0330208 0.0260781 -0.0332358 -0.0311973 0.0408675 -0.0322194 0.149408 -0.1176196 -0.0327338 -0.0755386 -0.042822 0.0810264 -0.0194844 -0.0878819 -0.0187411 0.1433401 -0.1176209 0.032743 0.075531 0.0428313 0.081023 -0.0194863 0.0878741 -0.0187438 0.1433444 -0.0151016 0.1001047 -0.0340617 0.1173084 -0.0228955 0.0119254 -0.0437682 0.0122409 0.1519764 -0.0151125 -0.1001052 0.0340583 -0.1173086 -0.0228859 0.0119212 0.0437649 0.012237 0.1519784 unknown
polarizability: 255.8355684|-0.0021069|159.2088657|0.002516|2.0694614|66.2881981 unknown
InChI: InChI=1S/C14H10O/c1-3-7-13-11(5-1)9-10-12-6-2-4-8-14(12)15-13/h1-10H
charge 0 multiplicity 1
25 atoms
O  0.000028 0.950471 0.846281
C  -1.600517 -0.803044 0.04476
C  1.600521 -0.803113 0.044803
C  -1.243641 0.558599 0.271276
C  1.243696 0.558546 0.271308
C  -0.685186 -1.939689 0.219819
C  0.685136 -1.939719 0.219838
C  -2.939166 -1.0601 -0.369797
C  2.93917 -1.060226 -0.369718
C  -2.168182 1.60342 0.081899
C  2.168286 1.603328 0.081955
C  -3.874491 -0.023138 -0.563217
C  3.874543 -0.023303 -0.563116
C  -3.487579 1.317601 -0.336779
C  3.487682 1.317453 -0.33669
H  -1.179666 -2.91781 0.292835
H  1.179572 -2.917861 0.292869
H  -3.2377 -2.101264 -0.542699
H  3.237664 -2.101402 -0.542611
H  -1.843749 2.627703 0.288483
H  1.84389 2.627625 0.288529
H  -4.895782 -0.257996 -0.880446
H  4.895832 -0.258205 -0.880318
H  -4.205024 2.133852 -0.472535
H  4.205165 2.133673 -0.47243
