program: Gaussian 09
title: 000136071
version: EM64L-G09RevD.01
frameworkgroup: C1[X(C8H6O2)]
method: RPBEPBE
basis: SDD
operation: Freq
keyword: #p
keyword: freq=noraman
keyword: PBEPBE/SDD
title: #p freq=noraman PBEPBE/SDD
converged: NO NO NO NO
title: Mulliken charges:
elementType: O O C C C C C C C C H H H H H H
charge: -0.271083 -0.271071 0.231653 0.231669 -0.345199 -0.345197 -0.220753 -0.220747 -0.130633 -0.130628 0.255387 0.255384 0.233459 0.233458 0.247152 0.247151
chargesum: 0.00000
title: Mulliken charges with hydrogens summed into heavy atoms:
elementType: O O C C C C C C C C
charge: -0.271083 -0.271071 0.231653 0.231669 -0.089812 -0.089813 0.012706 0.012711 0.116519 0.116522
polarizability: 1.24677623e+02 -1.00575897e-04 9.40886446e+01 -7.58074569e-04 9.03998467e-04 3.61509567e+01
1716.lowfreq: -5.6272 -0.0008 -0.0005 0.0006 9.9387 18.1934 78.4221 162.8480 277.9629
frequency: 78.4171 162.8228 277.9602 364.0729 447.7691 460.6766 468.4238 517.5755 538.9196 557.0777 689.0746 710.9850 725.3181 756.9071 788.6712 828.4662 849.5244 856.3064 927.4748 952.8920 967.6707 1025.7403 1032.4952 1068.6686 1141.8294 1162.2234 1189.3374 1270.8534 1273.1542 1330.0772 1379.6361 1442.9558 1475.5395 1593.6562 1609.4927 1652.4389 3139.2292 3152.4708 3163.7543 3175.6702 3216.3338 3246.0789
redmass: 4.3485 5.1668 5.2442 4.8754 3.2254 5.0040 8.7033 7.4646 4.4921 8.4398 4.4050 6.2154 1.2693 1.2257 5.5191 1.1936 1.3461 7.3522 1.3677 4.8997 1.2963 1.9864 5.1171 4.2091 1.6613 1.1092 1.5994 1.4698 1.8677 1.3014 7.6123 2.4283 3.1335 7.3893 7.3976 6.9011 1.0856 1.0902 1.0947 1.1007 1.0876 1.1046
irintensity: 13.6964 0.0000 0.1370 5.1024 3.9833 0.0000 1.6923 0.1641 0.0000 4.1760 0.0000 15.6807 53.0884 138.6611 11.7087 0.0001 0.0000 22.9485 6.8413 51.7997 0.0000 19.2388 34.1198 0.2193 4.7230 6.3370 15.7847 0.8457 213.1788 0.1550 13.6458 4.6695 198.5973 23.7123 0.5908 65.6758 1.5733 12.2197 9.2605 9.8566 1.6861 9.8582
temp: 298.150 k
press: 1.00000 atm
elementType: 8 8 6 6 6 6 6 6 6 6 1 1 1 1 1 1
symmnumber: 1
zpe: 309047.1 jmol-1
zpe.correction: 0.117710 hartree
zpe.thermalcorrener: 0.125149 hartree
zpe.thermalcorrenthalpy: 0.126093 hartree
zpe.thermalcorrgfe: 0.085483 hartree
zpe.sumelectzpe: -458.145863 hartree
zpe.sumelectthermal: -458.138424 hartree
zpe.sumelectthermalent: -458.137480 hartree
zpe.sumelectthermalfe: -458.178090 hartree
dipole: -0.0584 -0.0001 0.0020
dipole: 0.0584
quadrupole: -44.0261 -56.0401 -61.9140
quadrupole: 0.0001 -0.0052 0.0004
quadrupole: 9.9673 -2.0467 -7.9206 0.0001 -0.0052 0.0004
hfenergy: -458.2635732 hartree
pointgroup: C01 [X(C8H6O2)]
dipole: 0.0229588 -0.000027 -0.0007682 debye
dipolederiv: -1.4280893 0.2011664 0.0001155 -0.269025 -0.4666546 -0.000015 0.0001316 -0.0003704 -0.135284 -1.4281463 -0.2011898 0.0001368 0.2690114 -0.4666631 0.0000145 0.0001598 0.0003283 -0.1352774 0.8749355 0.1207715 0.0002086 0.7034041 0.0603277 -0.0000241 0.0002016 0.0001092 0.065668 0.8749794 -0.1207666 0.0001379 -0.7033979 0.0603253 0.0000167 0.0000913 -0.0000869 0.0656752 -0.1903689 -0.0348223 0.0000129 0.0633964 0.0770526 0.0000334 -0.0000418 0.0000261 -0.1580514 -0.1903721 0.0348225 0.0000279 -0.0634054 0.0770566 -0.0000298 0.000005 -0.00003 -0.1580542 0.0250067 -0.0173941 0.0000236 -0.1002432 0.0011852 -0.0000201 0.0000866 -0.0000212 -0.1747344 0.0250084 0.0173943 0.0000069 0.100249 0.0011915 0.000003 0.000032 0.0000004 -0.1747341 0.7095058 -0.3043095 -0.0004328 -0.5780645 0.2560825 0.0000533 -0.0004404 0.000237 -0.152637 0.7095205 0.304331 -0.0004158 0.5780739 0.2561175 -0.0000497 -0.0004363 -0.0002068 -0.1526312 0.1002597 -0.0247384 -0.0000117 -0.0073366 -0.0465245 0.0000046 -0.0000135 -0.0000041 0.1759071 0.1002575 0.0247367 -0.0000113 0.0073381 -0.0465291 0.0000068 -0.000005 0.0000038 0.1759065 -0.0669738 0.0868263 -0.0000187 0.0909536 0.040042 0.000014 -0.00003 0.0000183 0.1681624 -0.0669702 -0.0868287 -0.0000113 -0.0909603 0.0400354 -0.000004 -0.0000091 -0.000001 0.1681613 -0.0242748 -0.0272553 0.0001151 -0.070078 0.0784781 0.0000601 0.0001315 0.0000832 0.2109626 -0.0242781 0.027256 0.0001165 0.0700845 0.078477 -0.0000638 0.0001366 -0.000086 0.2109607 unknown
polarizability: 124.6776234|0.0003588|94.0886446|-0.0007581|-0.000904|36.1509567 unknown
InChI: InChI=1S/C8H6O2/c1-2-4-8-7(3-1)9-5-6-10-8/h1-6H
charge 0 multiplicity 1
16 atoms
O  1.21409 1.462004 0.000319
O  1.21411 -1.461965 0.000252
C  0.004367 0.711389 -0.000024
C  0.004384 -0.711388 -0.000007
C  -1.207276 1.417879 -0.000246
C  -1.207248 -1.417892 -0.000149
C  -2.433443 0.706361 -0.000296
C  -2.433425 -0.706396 -0.000277
C  2.398132 0.677893 -0.000441
C  2.398132 -0.677858 -0.000453
H  -1.179043 2.512217 -0.000269
H  -1.17901 -2.512235 -0.000111
H  -3.37837 1.259467 -0.000392
H  -3.378336 -1.25953 -0.000332
H  3.29876 1.289448 -0.001023
H  3.298776 -1.289394 -0.001051
