program: Gaussian 09
title: 000136068
version: EM64L-G09RevD.01
frameworkgroup: C1[X(C9H8O)]
method: RPBEPBE
basis: SDD
operation: Freq
keyword: #p
keyword: freq=noraman
keyword: PBEPBE/SDD
title: #p freq=noraman PBEPBE/SDD
converged: YES YES YES YES
title: Mulliken charges:
elementType: O C C C C C C C C C H H H H H H H H
charge: -0.261228 0.341747 -0.512744 0.117525 -0.360459 -0.195990 -0.347891 -0.253942 -0.173994 -0.216199 0.231831 0.231819 0.230860 0.215982 0.254436 0.227862 0.239593 0.230791
chargesum: 0.00000
title: Mulliken charges with hydrogens summed into heavy atoms:
elementType: O C C C C C C C C C
charge: -0.261228 0.341747 -0.049094 0.117525 -0.129599 0.019992 -0.093455 -0.026080 0.065599 0.014592
polarizability: 1.26313231e+02 -3.72447091e+00 1.04930619e+02 1.00972452e-04 2.30341229e-03 4.31611859e+01
1716.lowfreq: -14.3992 -9.8289 -0.0006 -0.0006 0.0003 11.1271 78.2546 160.8502 261.1894
frequency: 78.2337 160.8497 261.1888 353.4987 430.0057 455.5986 465.3469 506.1319 533.0784 574.2202 702.8508 714.6663 737.3333 761.8181 786.9626 861.1332 868.7657 920.6662 938.3765 942.3648 978.0758 983.0574 1020.4184 1033.6412 1100.8715 1166.1640 1170.5337 1193.6653 1203.7804 1241.7686 1264.9859 1331.4267 1362.6898 1387.1578 1444.0590 1460.3549 1482.5814 1589.2025 1622.7914 1676.4798 2942.9184 2972.6225 3116.3574 3137.2121 3153.5011 3156.8421 3172.0018 3202.1726
redmass: 2.7476 3.8712 3.5617 4.1651 2.5690 3.2572 7.1159 7.2587 3.4320 6.7457 2.2231 5.5046 1.5518 1.2882 5.3672 1.3354 5.8368 1.2327 1.4165 3.5277 1.3856 1.6953 2.5038 2.1438 1.9906 1.2753 1.4791 1.0859 1.9557 1.7019 1.5855 1.7415 1.4572 6.3766 2.3542 1.2214 2.2683 6.5455 7.2437 6.4247 1.0591 1.1002 1.0883 1.0883 1.0873 1.0943 1.0994 1.1005
irintensity: 0.6569 2.7899 3.3009 2.5145 21.4497 1.8583 0.4693 0.2529 0.3104 2.3003 0.8048 6.9413 32.2887 123.3149 4.8744 0.1860 9.1384 0.7128 4.1490 7.8588 0.0496 0.0037 52.7041 20.6851 50.8486 18.6003 35.6591 1.0581 11.4651 81.2820 49.7218 7.3034 0.3403 4.9896 25.2658 5.1622 70.6689 26.1994 2.2024 59.8675 46.9162 24.1274 8.1084 10.4375 7.1036 23.2542 12.7558 24.1409
temp: 298.150 k
press: 1.00000 atm
elementType: 8 6 6 6 6 6 6 6 6 6 1 1 1 1 1 1 1 1
symmnumber: 1
zpe: 374553.3 jmol-1
zpe.correction: 0.142660 hartree
zpe.thermalcorrener: 0.150186 hartree
zpe.thermalcorrenthalpy: 0.151130 hartree
zpe.thermalcorrgfe: 0.110352 hartree
zpe.sumelectzpe: -422.253326 hartree
zpe.sumelectthermal: -422.245800 hartree
zpe.sumelectthermalent: -422.244856 hartree
zpe.sumelectthermalfe: -422.285633 hartree
dipole: -0.1898 1.4688 -0.0001
dipole: 1.4810
quadrupole: -49.1332 -53.5379 -62.8061
quadrupole: -1.7081 0.0005 0.0009
quadrupole: 6.0259 1.6212 -7.6470 -1.7081 0.0005 0.0009
hfenergy: -422.3959857 hartree
pointgroup: C01 [X(C9H8O1)]
dipole: -0.0690115 0.5785879 -0.000024 debye
dipolederiv: -1.7053546 0.1692941 -0.0000698 -0.2008878 -0.5072341 -0.0000138 -0.000152 0.0001234 -0.1710373 -0.0214375 -0.051079 -0.0000343 -0.3582355 -0.0642457 0.0000054 -0.0000552 0.0000559 -0.0614577 -0.0266101 0.018382 -0.0000322 0.0108978 0.073793 -0.0000204 -0.0000136 -0.0001213 0.285217 1.0426225 0.2161151 0.0000075 0.6886625 0.1323518 0.0000227 0.0000094 -0.0000306 0.0745862 -0.0134096 -0.0093849 -0.0000153 0.0436767 0.1244429 0.0000125 0.0000232 0.0000034 -0.1593911 -0.0062702 0.0165629 0.0000985 0.3065359 -0.1716335 0.0000325 0.0000416 0.0001023 -0.31419 -0.2915064 -0.0776129 -0.0000217 0.0442049 0.0729245 0.0000013 -0.0000056 -0.0000022 -0.1613684 -0.0395213 0.0968432 -0.0000098 0.0725603 -0.0856507 -0.000018 -0.0000161 -0.0000096 -0.1776972 1.0614533 -0.3303358 0.0001331 -0.583878 0.4502988 -0.0000172 0.0002189 -0.0000719 -0.0790096 0.1086868 0.001895 -0.0000016 -0.0589743 0.083592 0.0000123 -0.000015 0.0000037 -0.1641041 0.0291375 -0.024347 -0.0017647 0.0302721 -0.050086 -0.1071525 0.0321857 -0.1524894 -0.0409825 0.0291479 -0.0243806 0.0017834 0.0302522 -0.05021 0.1071607 -0.0321643 0.1524809 -0.0408266 0.0799845 0.0304872 0.0000026 -0.0123541 -0.1163034 -0.000005 0.0000052 -0.0000029 0.1475452 -0.1263218 0.0408736 -0.000054 0.0739479 0.0719187 0.0000093 -0.0000491 -0.0000013 0.172488 0.1010358 -0.0252321 0.000003 -0.0035339 -0.0596496 -0.0000047 0.0000002 -0.0000065 0.1717061 -0.0852031 -0.0870426 0.0000105 -0.0953684 0.0368159 0.000004 0.0000114 0.0000082 0.167022 -0.0591091 -0.0570587 -0.0000445 -0.0853801 0.0260545 -0.0000237 -0.0000357 -0.0000392 0.1905273 -0.0773246 0.0960206 0.0000093 0.0976017 0.0328209 -0.0000054 0.0000109 -0.0000029 0.1609725 unknown
polarizability: 126.2382056|-3.9332302|105.0056452|0.0001235|0.0023023|43.1611859 unknown
InChI: InChI=1S/C9H8O/c1-2-6-9-8(4-1)5-3-7-10-9/h1-4,6-7H,5H2
charge 0 multiplicity 1
18 atoms
O  -1.167561 -1.453941 0.000136
C  0.003283 0.743561 0.000147
C  -1.310007 1.524118 0.000293
C  0.019664 -0.674335 0.000112
C  1.252054 1.409109 0.00008
C  -2.508402 0.596045 -0.000085
C  1.225252 -1.40749 0.000044
C  2.471521 0.696935 0.000013
C  -2.39276 -0.753078 -0.000107
C  2.455418 -0.71838 0.000001
H  -1.348564 2.196183 0.883685
H  -1.348426 2.196775 -0.882645
H  1.262857 2.506644 0.000091
H  -3.514423 1.027585 -0.000302
H  1.176873 -2.50063 0.000024
H  3.423437 1.238198 -0.00003
H  -3.227637 -1.456608 -0.000314
H  3.39392 -1.283292 -0.000043
