program: Gaussian 09
title: 000136067
version: EM64L-G09RevD.01
frameworkgroup: C1[X(C8H6N2)]
method: RPBEPBE
basis: SDD
operation: Freq
keyword: #p
keyword: freq=noraman
keyword: PBEPBE/SDD
title: #p freq=noraman PBEPBE/SDD
converged: NO YES YES YES
title: Mulliken charges:
elementType: N N C C C C C C C C H H H H H H
charge: -0.000522 -0.000522 0.350231 0.350229 -0.301749 -0.301750 -0.458774 -0.458774 -0.330220 -0.330220 0.239307 0.239307 0.253949 0.253951 0.247779 0.247779
chargesum: 0.00000
title: Mulliken charges with hydrogens summed into heavy atoms:
elementType: N N C C C C C C C C
charge: -0.000522 -0.000522 0.350231 0.350229 -0.062442 -0.062443 -0.204825 -0.204823 -0.082441 -0.082441
polarizability: 1.37131650e+02 -4.59625599e+00 1.04743888e+02 3.17536061e-04 -8.74951536e-04 3.88260279e+01
1716.lowfreq: -11.6382 -0.0009 -0.0003 0.0006 3.2061 7.2232 166.9772 180.2586 344.9304
frequency: 166.9772 180.2586 344.9304 348.5130 467.6934 475.8996 486.3427 530.8802 649.5247 665.5214 777.5558 784.2680 791.7856 806.5924 862.6068 919.5440 923.0017 935.7583 970.9478 978.8427 1011.1386 1030.3550 1169.3570 1187.5522 1228.2566 1266.7008 1269.6058 1327.4510 1370.9106 1387.4798 1394.7236 1433.6746 1478.7162 1541.9272 1547.9553 1610.0331 3113.5996 3114.0428 3135.6929 3136.1316 3160.4389 3161.3825
redmass: 4.7177 4.4910 4.4091 2.6365 2.4917 5.6533 9.8307 6.8886 7.0008 3.6887 4.9845 7.7237 1.7287 1.8203 1.3615 1.3665 5.7047 1.6254 1.4362 1.4596 3.1383 2.2144 1.9577 1.5094 2.2024 1.6118 1.9458 5.1762 1.3150 2.7124 3.7642 1.8087 2.9505 5.4804 6.3512 6.9529 1.0916 1.0912 1.0881 1.0872 1.0987 1.0988
irintensity: 0.4110 5.2846 0.5818 0.0000 16.6773 0.0000 0.0000 0.0000 9.1417 18.4102 0.0000 8.3590 0.0000 0.0000 74.2221 19.4953 0.0000 0.0000 0.0000 1.8351 6.9953 0.0000 0.8580 0.0000 9.9221 0.0000 33.9563 1.8807 6.1272 0.0000 0.0000 0.0000 12.5850 34.3782 0.0000 0.0000 32.2638 0.0276 1.9872 0.0000 59.7591 0.0002
temp: 298.150 k
press: 1.00000 atm
elementType: 7 7 6 6 6 6 6 6 6 6 1 1 1 1 1 1
symmnumber: 1
zpe: 317875.1 jmol-1
zpe.correction: 0.121072 hartree
zpe.thermalcorrener: 0.127849 hartree
zpe.thermalcorrenthalpy: 0.128793 hartree
zpe.thermalcorrgfe: 0.089746 hartree
zpe.sumelectzpe: -417.261728 hartree
zpe.sumelectthermal: -417.254951 hartree
zpe.sumelectthermalent: -417.254007 hartree
zpe.sumelectthermalfe: -417.293054 hartree
dipole: 0.0000 0.0000 0.0000
dipole: 0.0000
quadrupole: -67.1902 -48.7716 -60.6175
quadrupole: -10.4784 0.0001 -0.0002
quadrupole: -8.3304 10.0881 -1.7577 -10.4784 0.0001 -0.0002
hfenergy: -417.3828006 hartree
pointgroup: C01 [X(C8H6N2)]
dipole: -0.0000017 -0.0000023 0. debye
dipolederiv: -0.3735276 0.032567 0.0000002 0.0102955 -0.1940755 0.0000007 -0.0000002 0.0000006 -0.2443538 -0.3735261 0.032563 0.0000002 0.0102939 -0.1940777 0.0000007 -0.0000002 0.0000006 -0.2443543 0.0497801 -0.1920863 -0.0000024 -0.0468052 -0.1695259 -0.0000032 0. -0.0000022 0.0912386 0.0497827 -0.1920869 -0.0000024 -0.0468044 -0.1695261 -0.0000032 0. -0.0000022 0.0912385 -0.2043731 0.158944 0.0000026 -0.1074961 0.1068886 0.0000032 -0.0000016 0.0000017 -0.1068275 -0.2043746 0.1589437 0.0000026 -0.1074973 0.1068891 0.0000032 -0.0000016 0.0000017 -0.1068267 0.1402419 0.1739735 0.0000019 0.0520559 0.3427586 0.0000048 0.0000007 0.0000036 -0.0709238 0.1402376 0.1739759 0.0000019 0.0520545 0.342754 0.0000048 0.0000007 0.0000036 -0.0709241 0.2756537 -0.2824066 -0.0000046 -0.0261267 0.0755298 0.0000022 -0.0000021 0.0000033 -0.1027373 0.2756567 -0.2824061 -0.0000046 -0.0261262 0.0755311 0.0000022 -0.0000021 0.0000033 -0.1027368 0.0896797 -0.0409372 -0.0000004 0.0365378 -0.0890277 -0.0000032 0.0000005 -0.0000027 0.1561867 0.0896798 -0.0409362 -0.0000004 0.0365379 -0.0890273 -0.0000032 0.0000005 -0.0000027 0.1561868 0.0751905 0.0374346 0.0000007 -0.0000029 -0.1001439 -0.0000027 0. -0.0000023 0.1257999 0.0751908 0.0374329 0.0000007 -0.0000021 -0.1001396 -0.0000027 0. -0.0000023 0.1258011 -0.0526454 0.112512 0.0000021 0.0815421 0.0275967 -0.0000018 0.0000027 -0.000002 0.1516168 -0.0526465 0.1125126 0.0000021 0.0815432 0.0275958 -0.0000018 0.0000027 -0.000002 0.151616 unknown
polarizability: 136.8420323|-5.515593|105.033506|-0.0002924|0.0008837|38.8260279 unknown
InChI: InChI=1S/C8H6N2/c1-3-9-6-8-2-4-10-5-7(1)8/h1-6H
charge 0 multiplicity 1
16 atoms
N  2.47309 0.687546 0.000002
N  -2.473064 -0.687532 -0.000002
C  0.01762 0.722312 0.00001
C  -0.017596 -0.722298 -0.00001
C  1.227536 -1.427736 -0.000022
C  -1.22751 1.427749 0.000022
C  1.306458 1.359332 0.000015
C  -1.306432 -1.359322 -0.000015
C  2.419742 -0.699566 -0.000014
C  -2.419716 0.699577 0.000014
H  1.242919 -2.523156 -0.000036
H  -1.242896 2.523169 0.000036
H  1.373137 2.455068 0.000027
H  -1.373115 -2.455055 -0.000027
H  3.392429 -1.202164 -0.000024
H  -3.392403 1.202176 0.000024
