program: Gaussian 09
title: 000136044
version: EM64L-G09RevD.01
frameworkgroup: C1[X(C30H18)]
method: RPBEPBE
basis: SDD
operation: Freq
keyword: #p
keyword: freq=noraman
keyword: PBEPBE/SDD
title: #p freq=noraman PBEPBE/SDD
converged: NO YES NO NO
title: Mulliken charges:
elementType: C C C C C C C C C C C C C C C C C C C C C C C C C C C C C C H H H H H H H H H H H H H H H H H H
charge: 0.239176 0.447802 0.224589 0.443523 0.486109 -0.633695 0.470376 0.429912 0.432728 -0.735141 -0.698084 -0.688411 -0.611823 -0.500427 -0.495213 0.420209 -0.714534 0.399619 -0.678601 -0.674771 0.406536 0.404293 -0.440901 -0.427962 -0.424597 -0.423019 -0.246529 -0.242568 -0.244214 -0.243425 0.232332 0.249987 0.251231 0.252126 0.229672 0.240338 0.239208 0.245927 0.248266 0.248029 0.242499 0.242596 0.241501 0.241252 0.228791 0.228789 0.228299 0.228196
chargesum: 0.00000
title: Mulliken charges with hydrogens summed into heavy atoms:
elementType: C C C C C C C C C C C C C C C C C C C C C C C C C C C C C C
charge: 0.239176 0.447802 0.224589 0.443523 0.486109 -0.401363 0.470376 0.429912 0.432728 -0.485154 -0.446852 -0.436285 -0.382150 -0.260088 -0.256006 0.420209 -0.468608 0.399619 -0.430335 -0.426742 0.406536 0.404293 -0.198402 -0.185365 -0.183096 -0.181766 -0.017738 -0.013779 -0.015914 -0.015229
polarizability: 9.71292194e+02 -6.21610758e+00 3.67719222e+02 -6.30930264e-04 3.48165900e-03 1.17823999e+02
1716.lowfreq: -0.0009 0.0002 0.0012 5.5273 7.7038 15.8961 33.3262 43.9806 64.3993
frequency: 32.7911 43.8199 64.3953 67.1507 96.1790 118.6634 141.2238 147.5241 198.2504 214.1582 215.2596 254.0052 255.1576 283.4803 331.1881 331.4335 354.6332 366.9282 394.6464 412.6770 414.1903 459.4987 459.7255 468.3934 471.6201 476.8473 480.1534 505.6142 539.6412 544.4213 546.4625 560.1035 573.9312 611.7525 621.2230 628.9158 647.0703 665.5328 694.0006 724.2303 738.2677 743.8299 751.6458 755.9708 759.4309 770.8854 782.2284 784.3767 792.2672 802.7946 813.3734 821.3546 843.0357 846.7673 848.4971 860.7802 862.6479 881.1192 897.0700 898.0142 906.2229 907.8089 926.9691 934.5149 938.9812 954.1856 965.7096 969.1481 969.8484 986.8314 989.3666 990.5425 1009.6192 1020.0273 1101.4809 1125.8045 1141.7859 1169.4368 1171.6474 1178.2878 1186.9437 1193.7596 1198.8261 1210.7199 1219.6892 1233.3467 1251.1961 1266.2728 1277.0505 1281.2242 1281.9382 1290.9093 1306.5447 1319.0537 1331.5134 1357.5050 1381.2179 1398.2948 1410.2386 1421.2350 1427.4256 1429.7010 1437.3769 1438.5989 1446.7775 1452.2639 1460.6859 1479.7477 1504.7806 1520.1786 1539.2158 1552.9441 1562.9313 1568.5527 1595.3500 1605.1851 1618.1538 1627.7518 1635.1313 1643.3043 3113.2954 3114.4864 3115.4766 3115.7969 3116.6272 3117.8681 3118.4768 3118.9111 3119.9533 3123.3571 3124.2392 3128.1471 3138.1026 3141.6177 3141.8794 3142.0376 3160.7612 3161.2011
redmass: 5.3876 4.3259 5.0907 6.0361 4.5209 5.4294 4.3476 5.9364 5.0477 6.6680 4.3863 5.3692 4.2895 4.5354 5.6500 4.3012 3.7079 6.0447 3.3966 5.0288 3.4321 2.4675 5.8925 2.3920 2.7915 2.7452 5.6844 6.1604 3.5676 6.5591 3.6707 3.3991 7.1871 6.8644 6.6965 7.1467 6.6419 3.6588 6.4899 6.2500 3.8889 6.1981 1.2521 1.2518 5.1175 2.6972 4.4853 2.3911 2.0103 1.9764 1.4043 5.4175 5.0876 1.3634 1.3499 3.0749 1.4958 1.6509 4.7827 1.5406 5.5330 1.4983 2.0901 1.6680 2.0126 2.3096 1.4203 3.4049 1.4054 1.4257 1.3513 1.3846 2.3453 2.2587 2.5098 1.8406 1.5658 1.1405 1.0880 1.3088 1.3652 1.3744 1.3718 1.6693 1.7879 2.0807 2.1225 2.2309 2.1970 2.8456 1.7869 1.5501 1.5368 2.7999 2.8540 2.0923 3.9653 2.5777 3.4924 3.6028 3.8054 3.5178 4.6760 5.6856 4.0577 3.8978 2.6335 3.1856 4.4842 4.8289 5.9517 6.5176 6.0631 6.1447 5.7961 6.1981 6.3587 6.8180 6.6815 7.1307 1.0910 1.0893 1.0910 1.0918 1.0898 1.0892 1.0863 1.0859 1.0904 1.0890 1.0884 1.0908 1.0887 1.0952 1.0975 1.0954 1.1003 1.1002
irintensity: 0.3449 0.0005 0.0057 0.1069 0.7686 0.2556 0.5965 0.5373 0.7406 0.2196 0.0226 0.3809 0.7391 0.1481 2.8085 0.7348 0.0234 1.7714 1.1998 0.9000 0.9485 3.8150 1.2892 30.3721 2.3226 19.0129 1.7668 0.8470 0.6604 0.0942 0.3315 0.0159 4.3046 6.1456 1.3988 0.3124 0.3629 5.6529 1.0321 2.4099 0.7851 1.4414 75.9280 56.3933 0.4516 0.0286 0.1143 0.9442 0.5102 0.0478 0.0207 0.5090 9.4652 7.8824 4.3509 0.3219 1.2156 0.0000 0.2892 22.1751 0.2594 26.3944 0.0289 85.9790 60.5322 1.1916 16.4521 1.5826 20.3895 0.0397 0.0006 0.0293 7.1299 7.1660 1.9875 6.4853 9.5488 1.6645 0.6396 4.4424 0.9118 5.9127 2.3451 0.8925 4.2695 0.0359 5.9768 2.2857 3.1149 7.1683 0.8971 1.9382 1.6547 0.0539 0.4965 1.2789 11.7313 8.3288 0.3956 0.0527 0.4075 0.2636 0.4482 2.9683 5.5052 0.6410 2.8848 0.6251 41.3851 7.3348 2.4277 3.5488 2.4769 0.2972 0.6246 1.3217 0.7813 0.7789 1.6598 1.4774 0.2149 3.6729 14.9339 4.3403 14.1670 7.7767 6.5277 6.7855 8.9704 3.5163 4.0758 5.3563 7.4632 5.7531 57.9258 45.0385 90.6543 49.8506
temp: 298.150 k
press: 1.00000 atm
elementType: 6 6 6 6 6 6 6 6 6 6 6 6 6 6 6 6 6 6 6 6 6 6 6 6 6 6 6 6 6 6 1 1 1 1 1 1 1 1 1 1 1 1 1 1 1 1 1 1
symmnumber: 1
zpe: 985156.1 jmol-1
zpe.correction: 0.375226 hartree
zpe.thermalcorrener: 0.395698 hartree
zpe.thermalcorrenthalpy: 0.396643 hartree
zpe.thermalcorrgfe: 0.326568 hartree
zpe.sumelectzpe: -1152.110955 hartree
zpe.sumelectthermal: -1152.090483 hartree
zpe.sumelectthermalent: -1152.089539 hartree
zpe.sumelectthermalfe: -1152.159614 hartree
dipole: 0.0144 -0.1190 0.0004
dipole: 0.1199
quadrupole: -142.8170 -145.5041 -186.1432
quadrupole: -0.2995 0.0007 0.0016
quadrupole: 15.3377 12.6507 -27.9884 -0.2995 0.0007 0.0016
hfenergy: -1152.4861813 hartree
pointgroup: C01 [X(C30H18)]
dipole: 0.0056974 0.0468215 -0.0001575 debye
polarizability: 971.2996135|5.844748|367.7117846|-0.0295299|0.0652239|117.8240168 unknown
InChI: InChI=1S/C30H18/c1-2-7-21-13-26-16-28-18-30-24(14-27(28)15-25(26)12-20(21)6-1)10-9-23-11-19-5-3-4-8-22(19)17-29(23)30/h1-18H
charge 0 multiplicity 1
48 atoms
C  1.645808 -0.683896 -0.000231
C  -0.759347 -0.050956 0.000018
C  3.086898 -0.343433 -0.000188
C  -1.146909 -1.466401 -0.000425
C  1.251338 -2.098009 -0.000681
C  0.635394 0.284379 0.000106
C  4.069413 -1.420577 -0.00054
C  -3.149992 0.603596 0.000228
C  -3.537752 -0.815827 -0.000201
C  -0.106054 -2.448697 -0.000759
C  -1.767521 0.939676 0.000343
C  -2.518731 -1.808266 -0.000506
C  3.557964 0.981429 0.000088
C  2.280344 -3.124543 -0.001012
C  3.617718 -2.803613 -0.00094
C  4.948037 1.300758 0.00002
C  5.444652 -1.118449 -0.000546
C  5.921983 0.222677 -0.000288
C  -4.171675 1.59652 0.000512
C  -4.923065 -1.149807 -0.000315
C  -5.540732 1.255962 0.000425
C  -5.927623 -0.159318 -0.000002
C  5.417075 2.658034 0.000268
C  7.320956 0.547094 -0.000348
C  -6.581163 2.257541 0.000726
C  -7.333325 -0.491041 -0.000101
C  6.78394 2.942196 0.000217
C  7.744498 1.877205 -0.000089
C  -7.922676 1.895422 0.00061
C  -8.303212 0.504016 0.000186
H  0.891057 1.349722 0.000439
H  -0.380973 -3.511122 -0.001104
H  -1.478035 1.998318 0.000644
H  -2.806724 -2.867234 -0.000864
H  2.850694 1.818196 0.000229
H  1.9615 -4.173682 -0.001353
H  4.377843 -3.593889 -0.00123
H  6.169803 -1.94235 -0.000856
H  -3.883049 2.655454 0.000837
H  -5.214379 -2.207986 -0.000639
H  4.682863 3.472771 0.000511
H  8.054562 -0.26813 -0.000603
H  -6.292441 3.315577 0.001029
H  -7.624259 -1.5485 -0.000427
H  7.129588 3.981818 0.000408
H  8.814213 2.114107 -0.000129
H  -8.701241 2.666284 0.000834
H  -9.365862 0.237072 0.000099
