program: Gaussian 09
title: 000136041
version: EM64L-G09RevD.01
frameworkgroup: C1[X(C14H10O2)]
method: RPBEPBE
basis: SDD
operation: Freq
keyword: #pfreq=noraman
keyword: PBEPBE/SDD
title: #p freq=noraman PBEPBE/SDD
converged: NO YES YES YES
title: Mulliken charges:
elementType: O O C C C C C C C C C C C C C C H H H H H H H H H H
charge: -0.126984 -0.126988 -0.606844 -0.606847 0.428867 0.428863 0.428868 0.428871 -0.447265 -0.447265 -0.447265 -0.447265 -0.224866 -0.224866 -0.224867 -0.224867 0.278891 0.278892 0.240934 0.240934 0.240934 0.240934 0.229801 0.229801 0.229801 0.229801
chargesum: 0.00000
title: Mulliken charges with hydrogens summed into heavy atoms:
elementType: O O C C C C C C C C C C C C C C
charge: -0.126984 -0.126988 -0.327953 -0.327955 0.428867 0.428863 0.428868 0.428871 -0.206331 -0.206331 -0.206332 -0.206331 0.004935 0.004935 0.004934 0.004934
polarizability: 1.93930141e+02 -2.98931672e-05 1.53037210e+02 1.85288178e-05 3.74840237e-04 9.64030995e+01
1716.lowfreq: -11.5892 -10.5145 -0.0007 -0.0007 -0.0005 5.7549 65.9963 123.2307 157.9763
frequency: 65.9963 123.2305 157.9756 161.5264 240.5434 274.6752 341.5439 346.4183 357.3415 410.4354 452.0246 457.1181 499.8511 546.6151 577.5345 605.4139 615.4294 647.0110 709.8821 714.4046 748.4641 756.2918 763.2099 763.4839 791.3692 800.2607 807.9131 817.3420 865.8757 887.7746 894.2679 927.3760 946.3179 949.4420 988.1422 988.4725 1022.3969 1022.5246 1088.7442 1118.9015 1164.0567 1167.8839 1172.9466 1173.5594 1175.7227 1199.7243 1212.5433 1230.2532 1255.2473 1258.9924 1291.2382 1317.7329 1395.7460 1399.7420 1447.2546 1453.1971 1462.9217 1479.6525 1595.1606 1602.5964 1620.1827 1623.7007 3074.9092 3079.8774 3124.9484 3125.1530 3131.2464 3131.4665 3144.6927 3145.0335 3163.9115 3164.2828
redmass: 5.2518 4.1688 7.3433 4.1709 10.8863 4.6108 4.5344 4.0730 4.3531 4.8782 7.1538 3.8674 5.0353 4.2458 4.4197 4.0739 5.7479 6.6439 5.6045 6.5216 2.5502 1.3359 4.5771 7.9660 2.4031 2.7735 4.2262 2.8493 2.4199 1.9542 1.7736 5.0977 1.4028 1.4200 1.3277 1.3271 2.2179 2.3846 2.1239 1.6793 1.4037 2.6021 1.0708 1.0621 1.2500 1.8458 1.6603 1.4676 1.7212 4.4529 1.3817 1.4623 6.5987 7.4613 2.4171 2.5593 2.4939 2.9396 6.3406 7.1991 7.1633 7.2431 1.0880 1.0896 1.0859 1.0858 1.0898 1.0900 1.0945 1.0946 1.1004 1.1004
irintensity: 1.4982 0.0000 1.0511 0.2489 0.0000 0.7288 13.0168 0.4150 0.0000 2.6516 0.0132 19.1121 0.0000 15.6201 0.0000 0.0293 43.1220 0.8000 43.7574 1.4481 92.4517 32.5560 0.0000 1.1797 32.3785 12.9515 0.3145 0.5891 0.0000 0.0000 0.2263 3.6360 0.0665 2.7332 0.0000 0.0112 4.7295 0.8102 0.0000 3.1644 0.0000 17.4637 2.2614 0.0000 2.9336 0.0000 3.0760 0.5898 0.5653 16.8912 0.7770 0.0000 4.2192 0.1160 14.0653 0.0000 12.6354 3.4681 0.2090 0.0402 0.0000 0.7593 12.3855 2.2087 0.0000 4.3739 3.3618 1.6371 0.0000 52.7613 53.9574 8.3439
temp: 298.150 k
press: 1.00000 atm
elementType: 8 8 6 6 6 6 6 6 6 6 6 6 6 6 6 6 1 1 1 1 1 1 1 1 1 1
symmnumber: 1
zpe: 521805.8 jmol-1
zpe.correction: 0.198745 hartree
zpe.thermalcorrener: 0.209856 hartree
zpe.thermalcorrenthalpy: 0.210800 hartree
zpe.thermalcorrgfe: 0.161951 hartree
zpe.sumelectzpe: -688.755716 hartree
zpe.sumelectthermal: -688.744605 hartree
zpe.sumelectthermalent: -688.743661 hartree
zpe.sumelectthermalfe: -688.792510 hartree
dipole: 0.0000 0.0000 -3.7023
dipole: 3.7023
quadrupole: -80.1372 -76.1071 -104.8816
quadrupole: 0.0000 0.0000 0.0002
quadrupole: 6.9048 10.9348 -17.8396 0.0000 0.0000 0.0002
hfenergy: -688.9544609 hartree
pointgroup: C01 [X(C14H10O2)]
dipole: 0.0000239 -0.0010615 -1.4566129 debye
dipolederiv: -0.448707 0.0000063 -0.0000022 0.000006 -0.1493999 0.0522393 -0.0000078 0.0024342 -0.358027 -0.4487118 0.000006 -0.0000012 0.000007 -0.1494795 -0.0525444 0.0000051 -0.0027358 -0.3579529 0.5753799 -0.0000056 0.0000043 -0.0000036 0.2852934 -0.0986504 0.0000032 -0.0023207 0.328168 0.5753847 -0.000006 0.0000031 -0.0000071 0.2854409 0.0987148 0.0000026 0.0023826 0.3280174 -0.0592362 -0.0258623 -0.0405999 0.1142865 -0.0903155 -0.0332473 -0.1942042 -0.0140841 -0.0187658 -0.0592449 0.0258607 0.0405991 -0.1142881 -0.0903119 -0.0332502 0.1942091 -0.0140914 -0.0187536 -0.0592362 0.0258001 -0.040641 -0.1145718 -0.0902453 0.0333507 -0.1940422 0.0141948 -0.0188274 -0.0592413 -0.0258026 0.0406396 0.1145705 -0.0902488 0.0333548 0.1940356 0.0141853 -0.0188252 -0.0768324 0.0007375 0.0025888 -0.0684477 0.129971 -0.0011552 -0.0214363 -0.0071049 -0.1374945 -0.0768343 -0.0007271 -0.0025891 0.0684565 0.1299681 -0.0011524 0.0214372 -0.0071046 -0.137496 -0.0768331 -0.0007231 0.002593 0.0684249 0.1299801 0.0007647 -0.0215356 0.0067165 -0.1375076 -0.0768328 0.0007323 -0.0025891 -0.0684169 0.129983 0.0007639 0.0215396 0.0067174 -0.1375047 0.000383 -0.0631624 -0.0995662 -0.0911642 -0.0161416 0.0158714 -0.0593641 0.0361296 -0.0968671 0.0003831 0.0631585 0.0995709 0.091161 -0.0161455 0.0158709 0.0593709 0.0361303 -0.0968601 0.00039 0.0630137 -0.09966 0.0910752 -0.016222 -0.0159857 -0.059499 -0.036245 -0.0967902 0.0003794 -0.0630147 0.0996619 -0.0910764 -0.0162185 -0.0159916 0.0594985 -0.0362483 -0.0967871 0.0529187 -0.0000015 0.0000007 -0.0000031 -0.0661126 0.027672 -0.0000003 -0.0380553 0.042556 0.0529168 -0.000002 0. -0.000002 -0.0660938 -0.0275142 0.0000011 0.0382123 0.0425401 0.0945129 -0.031967 0.0273559 0.0179884 -0.0975467 0.0011934 0.0199648 0.0176613 0.1342325 0.0945149 0.0319584 -0.0273569 -0.0179957 -0.0975473 0.0011925 -0.0199656 0.0176623 0.1342311 0.0945134 0.0319993 0.027309 -0.0179666 -0.0975747 -0.0008549 0.01999 -0.0173238 0.1342597 0.0945144 -0.0320066 -0.0273105 0.0179597 -0.0975743 -0.000855 -0.0199918 -0.0173246 0.1342582 -0.0486204 0.0796244 0.0900961 0.0845734 0.0390737 -0.0402352 0.1023517 -0.038754 0.1126099 -0.0486195 -0.0796192 -0.0901029 -0.0845684 0.0390801 -0.0402352 -0.1023598 -0.0387535 0.1126028 -0.0486264 -0.0794886 0.090214 -0.0844191 0.0391969 0.0403391 0.1024763 0.0388572 0.1124945 -0.0486152 0.0794916 -0.0902175 0.0844214 0.0391906 0.0403443 -0.1024786 0.0388624 0.1124894 unknown
polarizability: 193.9301409|-0.0008223|153.03718|0.0014875|-0.0414294|96.4031299 unknown
InChI: InChI=1S/C14H10O2/c1-2-6-10-9(5-1)13-11-7-3-4-8-12(11)14(10)16-15-13/h1-8,13-14H
charge 0 multiplicity 1
26 atoms
O  -0.00005 -0.775423 2.124674
O  -0.000006 0.778503 2.123534
C  -0.000029 -1.277559 0.672001
C  0.000018 1.278529 0.670122
C  1.247488 -0.71101 0.027131
C  -1.247507 -0.710962 0.02709
C  1.247516 0.710986 0.026085
C  -1.247483 0.711034 0.026053
C  2.346631 -1.42596 -0.479403
C  -2.346659 -1.42587 -0.479483
C  2.346685 1.42515 -0.481498
C  -2.346612 1.42524 -0.481557
C  3.445939 -0.708164 -1.013471
C  -3.445926 -0.708031 -1.013579
C  3.445967 0.70653 -1.01451
C  -3.445901 0.706663 -1.014612
H  -0.000054 -2.372787 0.798187
H  0.000036 2.373938 0.79472
H  2.355678 -2.521835 -0.462931
H  -2.355749 -2.521745 -0.463018
H  2.355774 2.521048 -0.46663
H  -2.355661 2.521138 -0.466682
H  4.303649 -1.251722 -1.424597
H  -4.303642 -1.251556 -1.424736
H  4.303699 1.24945 -1.426432
H  -4.303601 1.249615 -1.426558
