program: Gaussian 09
title: 000136040
version: EM64L-G09RevD.01
frameworkgroup: C1[X(C30H18)]
method: RPBEPBE
basis: SDD
operation: Freq
keyword: #p
keyword: freq=noraman
keyword: PBEPBE/SDD
title: #p freq=noraman PBEPBE/SDD
converged: NO YES NO YES
title: Mulliken charges:
elementType: C C C C C C C C C C C C C C C C C C C C C C C C C C C C C C H H H H H H H H H H H H H H H H H H
charge: 0.307547 0.307538 0.508489 0.508489 0.086007 0.086007 0.223339 0.223338 -0.741413 -0.741408 0.433148 0.433148 -0.710414 -0.710412 -0.358885 -0.358885 -0.677769 -0.677767 -0.366674 -0.366673 0.406138 0.406138 -0.284689 -0.284690 -0.285531 -0.285531 -0.424075 -0.424074 -0.243781 -0.243781 0.234687 0.234685 0.252352 0.252352 0.230398 0.230397 0.248344 0.248343 0.229306 0.229307 0.231943 0.231943 0.231815 0.231815 0.241501 0.241501 0.228221 0.228221
chargesum: 0.00000
title: Mulliken charges with hydrogens summed into heavy atoms:
elementType: C C C C C C C C C C C C C C C C C C C C C C C C C C C C C C
charge: 0.307547 0.307538 0.508489 0.508489 0.086007 0.086007 0.223339 0.223338 -0.506727 -0.506723 0.433148 0.433148 -0.458062 -0.458060 -0.128488 -0.128488 -0.429426 -0.429425 -0.137368 -0.137367 0.406138 0.406138 -0.052746 -0.052747 -0.053716 -0.053716 -0.182574 -0.182574 -0.015561 -0.015560
polarizability: 8.34065278e+02 -1.09318382e-04 3.80015879e+02 9.74497227e-03 1.04121681e-02 1.17370543e+02
1716.lowfreq: -3.4428 -0.0011 -0.0003 0.0008 4.8093 5.0053 30.4284 31.5950 56.2740
frequency: 30.4259 31.4826 56.2715 79.9858 86.5815 95.1923 123.8663 157.3434 179.7105 192.0275 217.6396 240.0652 276.3011 278.2603 303.5283 340.6075 350.0806 395.6614 399.9891 402.7003 423.6642 429.4109 454.1798 461.4298 463.1182 469.6140 472.8392 514.1226 544.6939 557.6534 567.2209 568.4084 580.5513 614.5498 622.2791 625.8412 630.9585 692.5762 694.9396 708.3177 731.0405 740.5043 741.0325 751.3848 751.8943 770.4465 771.5948 783.9641 788.8176 797.3762 816.6077 817.8349 845.3082 848.4811 867.4448 871.8911 877.5325 900.2429 901.5859 918.3509 935.9856 947.4916 950.4221 953.1408 957.9149 970.1979 986.4514 989.0312 990.9902 992.1437 1009.0721 1012.7301 1039.2762 1053.8410 1064.4856 1108.0196 1124.3080 1134.7709 1170.2027 1179.1812 1180.1019 1185.8313 1190.0269 1200.5328 1225.8634 1247.5249 1252.4736 1252.8136 1273.0599 1279.0723 1285.5009 1295.2296 1308.8009 1319.5412 1332.8773 1355.8417 1373.6948 1383.5569 1390.2772 1409.3493 1427.8923 1435.1655 1435.2140 1442.7077 1446.7680 1457.2257 1462.9420 1486.2827 1494.8241 1521.2003 1540.8386 1552.1674 1564.1847 1566.5147 1586.1713 1606.9709 1610.6725 1618.9879 1623.4861 1640.7692 3113.6507 3115.8471 3116.2584 3118.8612 3119.5980 3124.1459 3128.8455 3130.0499 3140.0498 3142.0477 3143.0945 3146.6264 3150.9319 3160.0751 3160.7559 3165.5450 3170.2396 3176.1423
redmass: 5.8242 4.2843 4.1696 5.7394 3.7607 5.6758 3.7395 5.6678 5.6926 6.5996 4.1457 5.0766 4.0021 5.1627 5.5345 4.2637 3.8079 5.8121 6.6907 3.5039 2.9898 7.2801 4.9366 2.7416 3.1991 2.4380 2.9675 7.6598 3.4286 3.5659 4.9563 3.0302 7.3341 6.8721 6.8867 6.8923 7.2356 5.8268 3.2391 6.3488 2.3344 5.6344 2.8117 1.2527 6.4188 1.5380 2.0972 4.7069 1.9917 1.8885 6.0628 1.4141 1.4624 1.3005 2.9591 1.4458 1.5377 1.5550 5.8494 2.0276 1.6051 6.3767 1.8096 1.7599 1.3853 1.4068 1.3510 1.3533 1.3351 7.3483 2.3515 4.0523 7.1195 1.9029 2.2145 2.4666 1.9248 1.7255 1.1164 1.3281 1.0652 1.4755 1.1187 1.8235 1.4751 2.0923 1.7029 2.9441 2.3674 2.7604 1.5267 1.5368 2.0506 1.6919 3.1472 2.4194 5.7121 3.9799 4.4718 3.2607 3.6000 5.3510 3.0572 2.9194 4.5749 2.6597 3.6331 2.6301 2.9736 4.2171 5.7108 6.4061 5.5573 5.2611 7.3909 5.5903 5.4712 6.6706 6.6928 6.9142 1.0909 1.0907 1.0920 1.0859 1.0906 1.0884 1.0850 1.0853 1.0903 1.0953 1.0907 1.0900 1.0905 1.0929 1.1003 1.0920 1.0990 1.0952
irintensity: 0.3022 0.0000 0.3023 0.2156 0.0000 0.2145 0.0000 2.6785 0.5227 0.0021 0.0000 0.0001 0.0000 0.0146 0.0208 0.0003 0.0000 0.2294 0.6013 1.1121 1.2484 8.4784 0.1546 18.7376 0.0000 17.4928 0.1594 0.1241 0.0000 4.8449 0.2544 0.0000 0.0001 3.1495 5.9255 2.1725 0.2787 3.4973 0.0000 0.0638 50.0120 4.1462 0.0000 38.1054 1.8516 153.3447 0.0000 0.7460 0.0000 0.0000 0.4792 0.0001 6.5934 0.0000 0.3390 0.0630 0.0000 5.5344 0.0573 0.0000 109.1909 1.9147 0.0000 0.0000 5.5667 19.8231 0.0000 0.0000 0.0365 2.1691 7.4191 2.3218 0.0000 9.8418 4.5320 1.6879 7.5779 1.3479 2.3048 6.2380 0.3759 1.6163 0.2842 0.9428 0.0642 2.4058 0.8263 0.2875 0.2113 8.9782 0.0508 1.0735 10.3468 0.1605 1.1061 5.1437 1.5959 0.0572 0.0268 22.6013 3.6544 18.1739 11.6769 6.5984 4.6953 1.5413 0.0058 22.9685 22.8334 3.1777 1.2992 4.1210 0.0735 0.4965 0.1344 0.2655 0.9710 0.0646 0.7303 2.8099 0.4303 24.6887 1.4815 7.8596 1.2482 3.2533 0.5108 0.1561 19.2220 35.2059 24.1370 6.6998 2.7437 11.6402 71.2980 10.8569 49.7325 58.4202
temp: 298.150 k
press: 1.00000 atm
elementType: 6 6 6 6 6 6 6 6 6 6 6 6 6 6 6 6 6 6 6 6 6 6 6 6 6 6 6 6 6 6 1 1 1 1 1 1 1 1 1 1 1 1 1 1 1 1 1 1
symmnumber: 1
zpe: 986816.3 jmol-1
zpe.correction: 0.375858 hartree
zpe.thermalcorrener: 0.396459 hartree
zpe.thermalcorrenthalpy: 0.397403 hartree
zpe.thermalcorrgfe: 0.326532 hartree
zpe.sumelectzpe: -1152.111861 hartree
zpe.sumelectthermal: -1152.091260 hartree
zpe.sumelectthermalent: -1152.090316 hartree
zpe.sumelectthermalfe: -1152.161187 hartree
dipole: 0.0485 0.0000 0.0003
dipole: 0.0485
quadrupole: -142.7341 -144.6034 -186.0312
quadrupole: 0.0000 0.0056 0.0021
quadrupole: 15.0554 13.1862 -28.2416 0.0000 0.0056 0.0021
hfenergy: -1152.487719 hartree
pointgroup: C01 [X(C30H18)]
dipole: 0.0190909 -0.0000009 0.0001213 debye
polarizability: 834.0652777|-0.0005936|380.0158794|0.009745|0.0104122|117.3705429 unknown
InChI: InChI=1S/C30H18/c1-2-8-20-14-22-16-24-18-30-28-12-6-4-10-26(28)25-9-3-5-11-27(25)29(30)17-23(24)15-21(22)13-19(20)7-1/h1-18H
charge 0 multiplicity 1
48 atoms
C  1.966586 -0.73306 -0.000171
C  1.966586 0.733055 -0.000107
C  -0.52292 -0.731503 0.000021
C  -0.522919 0.731504 0.000183
C  3.254013 -1.462974 -0.000038
C  3.254011 1.462969 -0.000023
C  4.495213 -0.740561 0.000639
C  4.495212 0.740559 0.000632
C  0.738249 -1.407368 -0.000105
C  0.738251 1.407364 0.000143
C  -2.999052 -0.735998 0.000236
C  -2.99905 0.736004 0.000416
C  -1.75494 -1.424844 0.000056
C  -1.754937 1.424847 0.000394
C  3.295956 -2.888467 -0.00044
C  3.295949 2.888463 -0.000529
C  -4.247238 -1.423837 0.000245
C  -4.247234 1.423845 0.000607
C  5.714167 -1.480344 0.001126
C  5.714166 1.480344 0.001116
C  -5.477243 -0.733759 0.000441
C  -5.477241 0.733774 0.000631
C  4.507004 -3.596337 -0.000031
C  4.506995 3.596335 -0.000136
C  5.731669 -2.883547 0.000838
C  5.731664 2.883547 0.000791
C  -6.745448 -1.425019 0.00046
C  -6.745445 1.425038 0.000832
C  -7.943424 -0.721355 0.000645
C  -7.943422 0.721376 0.000833
H  0.711039 -2.500968 0.000034
H  0.711044 2.500966 0.000494
H  -1.753635 -2.522293 -0.000054
H  -1.753629 2.522296 0.000544
H  2.36533 -3.461987 -0.001142
H  2.36532 3.461979 -0.001314
H  -4.248673 -2.52136 0.000117
H  -4.248663 2.521369 0.000755
H  6.672211 -0.95465 0.001716
H  6.672207 0.954648 0.001742
H  4.502081 -4.691676 -0.000381
H  4.502074 4.691674 -0.00057
H  6.686459 -3.42034 0.001235
H  6.68645 3.420348 0.001209
H  -6.746331 -2.521724 0.000315
H  -6.746325 2.521743 0.000971
H  -8.897969 -1.259207 0.00065
H  -8.897965 1.259231 0.000976
