program: Gaussian 09
title: 000136036
version: EM64L-G09RevD.01
frameworkgroup: C1[X(C30H18)]
method: RPBEPBE
basis: SDD
operation: Freq
keyword: #p
keyword: freq=noraman
keyword: PBEPBE/SDD
title: #p freq=noraman PBEPBE/SDD
converged: NO NO NO NO
title: Mulliken charges:
elementType: C C C C C C C C C C C C C C C C C C C C C C C C C C C C C C H H H H H H H H H H H H H H H H H H
charge: 0.356630 0.356577 0.356614 0.356563 0.070768 0.070704 0.070727 0.070796 -0.764256 -0.764207 0.230161 0.230159 0.230144 0.230136 -0.366076 -0.366071 -0.366061 -0.366087 -0.369067 -0.369067 -0.369072 -0.369053 -0.284207 -0.284215 -0.284209 -0.284209 -0.286862 -0.286865 -0.286862 -0.286864 0.214166 0.214159 0.229298 0.229300 0.229303 0.229300 0.230673 0.230670 0.230667 0.230665 0.231910 0.231909 0.231909 0.231910 0.231874 0.231874 0.231873 0.231874
chargesum: 0.00000
title: Mulliken charges with hydrogens summed into heavy atoms:
elementType: C C C C C C C C C C C C C C C C C C C C C C C C C C C C C C
charge: 0.356630 0.356577 0.356614 0.356563 0.070768 0.070704 0.070727 0.070796 -0.550090 -0.550049 0.230161 0.230159 0.230144 0.230136 -0.136777 -0.136772 -0.136759 -0.136786 -0.138394 -0.138398 -0.138405 -0.138388 -0.052297 -0.052306 -0.052300 -0.052299 -0.054988 -0.054991 -0.054989 -0.054991
polarizability: 5.75277973e+02 1.17283940e-03 4.52787009e+02 -1.11941198e-03 -4.25455218e-03 1.16863884e+02
1716.lowfreq: -4.1639 -0.0011 -0.0004 0.0007 1.0595 6.6640 16.0943 41.9458 61.9277
frequency: 16.0943 41.9458 61.9215 78.4859 83.1510 98.1619 102.8111 140.1216 176.8894 193.1130 223.1376 225.4510 263.3138 269.4300 293.1199 306.8986 367.8757 402.0478 403.9649 416.1850 426.6721 427.8206 433.5459 434.1475 437.2333 484.0490 519.3643 522.2302 541.4159 567.8698 569.1572 571.1688 596.5887 614.9426 616.7148 625.1578 647.4507 681.8644 685.9735 686.2690 713.2253 730.0952 732.9329 733.6281 759.8787 768.8421 772.4254 779.3315 792.0799 797.3121 806.3887 830.1460 854.0694 868.1015 871.7427 899.4986 908.0521 950.5097 952.4216 956.6794 958.4010 984.7710 987.3834 989.4298 990.5058 990.9737 991.8116 992.3049 995.8380 1015.0919 1046.8172 1050.1962 1057.4673 1057.6350 1059.9512 1069.1269 1111.7154 1112.3146 1135.2521 1135.3709 1179.6540 1182.0098 1188.4460 1192.9004 1208.8676 1237.1523 1243.3084 1257.0683 1272.5804 1288.4011 1294.0045 1310.1940 1320.4265 1324.2982 1338.8625 1358.4675 1378.6509 1382.8572 1384.1907 1388.4549 1419.8635 1433.9030 1438.9837 1441.7249 1443.1070 1455.7126 1477.4636 1484.1431 1500.6814 1503.8261 1529.9296 1568.5245 1569.4689 1580.2958 1584.2727 1611.0895 1612.3572 1613.4744 1618.3726 1628.4627 3127.7228 3127.8926 3128.9462 3129.0248 3142.4782 3142.9829 3145.3639 3146.0438 3155.0968 3156.6950 3160.8471 3162.4540 3167.0451 3168.2400 3173.9194 3174.1901 3184.7544 3188.7583
redmass: 5.4817 4.5435 3.8197 3.8294 4.6355 5.4825 3.4543 5.5767 3.6154 5.9982 6.3078 4.4339 4.7636 4.1953 3.5120 5.5140 4.6980 6.6963 6.7177 2.8160 5.8839 3.0590 3.4286 3.1261 7.8514 2.9721 8.0398 5.0172 3.1386 3.0583 3.9761 3.0090 7.1007 6.5698 6.8976 7.1736 5.3093 6.6251 2.9600 5.6663 6.0671 2.5575 2.0890 1.7918 6.3327 1.4444 1.7951 1.6791 5.6196 1.9536 1.3789 1.4349 6.8636 1.4264 1.4639 1.7192 1.6780 1.4376 1.4261 1.3895 1.3776 1.3732 1.3463 8.0496 7.3569 1.3361 1.3323 7.2658 7.7752 7.0964 3.5233 1.9457 1.8322 7.2530 2.1554 2.2867 2.3784 2.4172 1.5694 2.0256 1.0586 1.1009 1.1083 1.0932 1.9490 2.8052 1.5375 1.5698 2.4599 1.6886 2.6909 1.7595 1.3272 1.8612 2.6010 5.7053 3.3092 6.2803 10.3940 10.7076 5.3449 2.8678 2.3623 2.4921 2.5023 3.8223 2.6100 2.4356 3.1177 2.8666 3.8431 4.3902 6.7680 7.0365 7.5567 5.2015 5.5944 5.4258 6.3622 7.0415 1.0849 1.0848 1.0852 1.0852 1.0895 1.0893 1.0902 1.0901 1.0944 1.0939 1.0949 1.0937 1.1000 1.0998 1.0950 1.0955 1.0862 1.0867
irintensity: 0.0000 0.1462 0.0000 0.0000 2.5162 0.1084 0.0000 0.0000 0.0000 0.0000 0.0022 2.1448 0.4798 0.0000 0.0000 0.0000 0.0000 1.5523 0.0000 0.5637 0.0016 13.7884 0.0000 0.0000 0.2212 0.0000 13.0908 0.2842 5.1312 0.0000 0.0000 0.0000 0.0000 0.0000 8.0143 0.0000 0.0000 0.6824 0.0014 3.0523 0.0000 63.6785 0.0001 0.0000 0.0000 295.5211 0.0001 0.0000 0.6970 0.0000 0.0000 0.0000 0.0000 0.0000 0.2385 0.0000 24.0900 0.0000 0.0000 0.0000 4.7383 0.0000 0.0000 0.0059 0.0000 0.0000 0.0264 5.5556 0.0000 0.0000 1.9221 0.0000 20.8655 0.0016 12.1245 0.0000 0.0000 3.3133 0.0000 2.1963 0.0000 0.2137 2.4105 0.0000 5.4946 0.0000 1.8888 0.0000 2.6036 0.0000 0.0000 0.3147 0.0000 15.4560 0.0000 11.4893 16.8097 0.0000 0.0006 0.0000 16.5255 65.4894 0.0000 13.7025 0.0000 0.0000 2.1120 0.0000 35.0966 36.4404 0.0000 0.6785 0.0000 0.0000 0.1318 0.0000 0.0000 0.3642 0.0291 0.0000 0.1752 0.0000 0.0000 0.1241 33.8682 0.0002 0.0005 42.5914 19.3326 0.0000 0.0003 32.1022 55.4652 0.0001 0.0143 93.5425 47.2397 0.0004
temp: 298.150 k
press: 1.00000 atm
elementType: 6 6 6 6 6 6 6 6 6 6 6 6 6 6 6 6 6 6 6 6 6 6 6 6 6 6 6 6 6 6 1 1 1 1 1 1 1 1 1 1 1 1 1 1 1 1 1 1
symmnumber: 1
zpe: 989864.3 jmol-1
zpe.correction: 0.377019 hartree
zpe.thermalcorrener: 0.397692 hartree
zpe.thermalcorrenthalpy: 0.398636 hartree
zpe.thermalcorrgfe: 0.327297 hartree
zpe.sumelectzpe: -1152.126834 hartree
zpe.sumelectthermal: -1152.106161 hartree
zpe.sumelectthermalent: -1152.105217 hartree
zpe.sumelectthermalfe: -1152.176557 hartree
dipole: 0.0000 0.0000 0.0003
dipole: 0.0003
quadrupole: -142.5232 -143.7876 -185.8482
quadrupole: 0.0002 -0.0004 -0.0022
quadrupole: 14.8631 13.5988 -28.4619 0.0002 -0.0004 -0.0022
hfenergy: -1152.5038533 hartree
pointgroup: C01 [X(C30H18)]
dipole: -0.0000067 0.0000073 0.0001179 debye
polarizability: 575.2779728|0.0000892|452.787009|0.0011194|0.0042545|116.8638844 unknown
InChI: InChI=1S/C30H18/c1-5-13-23-19(9-1)20-10-2-6-14-24(20)28-18-30-26-16-8-4-12-22(26)21-11-3-7-15-25(21)29(30)17-27(23)28/h1-18H
charge 0 multiplicity 1
48 atoms
C  -1.248144 -0.721204 0.000068
C  -1.248117 0.721209 -0.000416
C  1.248126 -0.721219 -0.000213
C  1.248144 0.721194 -0.000165
C  -2.524081 -1.459432 0.000445
C  -2.524045 1.459474 -0.000706
C  2.524065 -1.459483 -0.000641
C  2.524082 1.459422 0.000369
C  -0.000011 -1.386241 -0.000005
C  0.000012 1.386229 -0.000483
C  -3.769319 -0.737746 0.000192
C  -3.769307 0.737811 -0.000422
C  3.769308 -0.737802 -0.000372
C  3.769321 0.737735 0.000221
C  -2.564626 -2.885722 0.001155
C  -2.564532 2.885749 -0.001273
C  2.564591 -2.88577 -0.001396
C  2.564615 2.885712 0.001266
C  -4.987349 -1.481052 0.000555
C  -4.987293 1.481161 -0.000709
C  4.987327 -1.481126 -0.000698
C  4.987344 1.481052 0.000575
C  -3.774889 -3.594649 0.001489
C  -3.774779 3.594725 -0.001539
C  3.774849 -3.594712 -0.001742
C  3.774876 3.594644 0.001667
C  -5.001299 -2.883669 0.001182
C  -5.001202 2.88379 -0.001267
C  5.001258 -2.883745 -0.001306
C  5.001289 2.883665 0.001284
H  -0.000032 -2.476192 0.000418
H  0.000019 2.476183 -0.000696
H  -1.635124 -3.461096 0.001385
H  -1.63501 3.461091 -0.001489
H  1.635076 -3.461117 -0.001907
H  1.635107 3.461071 0.00177
H  -5.94741 -0.958618 0.000307
H  -5.947396 0.958797 -0.000496
H  5.947404 -0.958715 -0.000386
H  5.947407 0.958616 0.000281
H  -3.767165 -4.690077 0.001992
H  -3.766989 4.690155 -0.001954
H  3.76711 -4.690142 -0.002403
H  3.767139 4.690071 0.002388
H  -5.955835 -3.421213 0.001433
H  -5.955728 3.421348 -0.001494
H  5.955799 -3.421282 -0.001481
H  5.955817 3.421222 0.001516
