program: Gaussian 09
title: 000136021
version: EM64L-G09RevD.01
frameworkgroup: C1[X(C28H16)]
method: RPBEPBE
basis: SDD
operation: Freq
keyword: #p
keyword: freq=noraman
keyword: PBEPBE/SDD
title: #p freq=noraman PBEPBE/SDD
converged: NO NO NO NO
title: Mulliken charges:
elementType: C C C C C C C C C C C C C C C C C C C C C C C C C C C C H H H H H H H H H H H H H H H H
charge: -0.114217 -0.114133 0.256190 0.256215 0.310378 0.310423 0.327601 0.327587 0.173779 0.173762 -0.869670 -0.869678 0.622211 0.622213 -0.432032 -0.432043 -0.451674 -0.451670 -0.298897 -0.298899 -0.363251 -0.363249 -0.505597 -0.505597 -0.256928 -0.256930 -0.253609 -0.253610 0.229826 0.229828 0.230149 0.230150 0.228676 0.228675 0.232132 0.232132 0.224283 0.224282 0.250992 0.250992 0.228525 0.228524 0.231080 0.231079
chargesum: 0.00000
title: Mulliken charges with hydrogens summed into heavy atoms:
elementType: C C C C C C C C C C C C C C C C C C C C C C C C C C C C
charge: -0.114217 -0.114133 0.256190 0.256215 0.310378 0.310423 0.327601 0.327587 0.173779 0.173762 -0.639843 -0.639850 0.622211 0.622213 -0.201883 -0.201893 -0.222999 -0.222994 -0.066765 -0.066767 -0.138968 -0.138967 -0.254605 -0.254605 -0.028403 -0.028406 -0.022529 -0.022531
polarizability: 6.02817336e+02 -5.31502733e-04 4.02611684e+02 -1.09238904e-02 -7.03762740e-03 1.08886393e+02
1716.lowfreq: -1.6579 -1.5734 -0.0007 0.0006 0.0008 11.9293 22.0437 48.1210 71.6157
frequency: 22.0379 48.1019 71.6139 105.0977 121.4751 130.1765 135.1487 206.8490 243.2040 244.1804 262.4610 274.7064 279.6447 304.9127 321.9760 332.8202 412.3822 422.0871 436.0216 452.0433 454.0472 489.0630 509.5390 510.4220 515.9692 528.6339 543.0376 545.1099 581.7882 608.7303 614.9407 614.9949 619.5143 643.1211 661.1889 673.1575 707.2186 744.4223 757.3623 759.4594 762.6589 768.4760 780.5212 784.9211 803.8223 822.9015 841.4953 850.1309 871.0950 877.6627 881.9329 894.7520 905.9235 916.7737 927.8711 945.3612 959.9644 963.8927 979.0622 984.8296 989.4850 990.4044 992.7132 1033.3661 1040.7666 1045.3866 1063.5696 1088.0033 1095.8997 1108.9317 1121.5324 1142.3486 1160.3503 1177.6432 1179.0543 1189.8555 1217.2976 1217.3441 1240.9263 1244.3254 1273.9326 1278.8997 1296.0534 1314.0697 1320.8618 1331.0631 1356.4275 1372.9312 1380.4159 1384.5683 1405.4659 1410.5433 1416.0056 1421.7412 1439.2317 1448.7110 1450.2320 1469.9112 1499.1512 1502.5894 1530.9073 1535.2725 1577.1480 1580.3207 1590.2497 1601.7882 1602.6757 1611.7929 1617.1215 1625.8435 3121.2056 3121.3148 3131.3290 3131.7795 3133.9358 3135.5245 3139.7509 3147.9141 3148.4358 3151.1888 3156.2876 3160.2887 3163.4429 3166.6438 3170.2910 3175.4727
redmass: 4.9897 4.7183 3.9262 4.4361 4.5416 5.5950 4.2048 3.4259 5.2411 4.1350 4.8036 3.5489 6.6961 6.5419 4.9211 4.7474 7.0464 3.4676 6.0681 3.2772 3.7095 2.8329 5.8888 5.8899 3.2477 6.6701 7.9553 3.3955 3.6750 6.7986 3.3657 5.8646 6.8681 6.8854 3.3151 2.1875 6.1199 5.8817 1.3454 1.8790 1.9980 5.6010 1.3655 1.6132 1.9553 6.3048 6.2011 1.6502 1.7843 1.6796 5.9738 1.6294 4.4263 1.4093 2.1680 2.1882 1.4481 1.5411 1.3806 1.4058 1.3560 1.3713 8.0851 2.6396 2.1599 6.4516 3.2224 2.2045 8.4650 2.2279 2.3391 1.5580 1.4404 1.0719 1.0966 1.8866 1.2521 1.3885 1.4998 1.9784 1.6837 2.0782 2.1503 2.6648 3.2331 2.0140 2.6793 5.0954 4.5679 2.8987 4.0569 5.7755 5.0561 2.7624 3.5806 2.4315 3.0485 2.5327 3.3591 3.5986 4.6050 4.3749 7.4080 7.1010 4.5471 6.0051 5.1995 7.4258 5.9187 6.8686 1.0859 1.0858 1.0878 1.0884 1.0874 1.0873 1.0907 1.0942 1.0938 1.0879 1.0925 1.0962 1.0994 1.0938 1.0967 1.0943
irintensity: 0.0000 0.5009 0.0000 2.1635 0.0000 0.0608 0.4520 0.0000 0.0880 3.6633 1.4013 0.0000 0.3423 0.4393 0.0375 0.0000 0.1621 2.5453 0.0995 0.0000 5.7690 0.0000 2.8418 1.2125 8.4119 0.8302 7.9190 0.0000 0.9021 0.0732 1.8761 12.9007 1.7379 1.7861 0.0000 0.0000 0.2481 3.8150 0.0000 96.8418 61.7089 0.3122 125.3189 0.0000 0.0000 0.6459 2.9479 12.3664 0.0000 7.4031 0.0015 0.0000 1.7135 8.5859 0.0000 18.0822 0.0000 24.2430 0.0000 5.5615 0.0000 1.2003 0.1331 3.6921 12.6640 2.5804 3.6048 2.0035 0.0000 0.0070 10.3274 1.0647 0.2307 0.2381 0.3938 1.1400 0.0030 3.6544 16.2148 13.0963 6.3157 0.0314 0.0097 1.5093 6.8430 0.0038 9.9227 2.4031 1.6082 27.6153 0.8013 1.3160 0.0296 9.3947 2.7272 13.5168 1.5024 12.2606 3.6829 12.8320 0.0112 1.5569 0.0578 0.9746 2.5793 17.2174 6.2969 1.0285 3.2075 13.1134 1.5619 1.9229 0.0175 0.0127 16.7977 20.8389 15.3349 1.8708 24.1121 17.7832 0.2347 21.0775 52.8749 3.7710 65.4682 44.5269
temp: 298.150 k
press: 1.00000 atm
elementType: 6 6 6 6 6 6 6 6 6 6 6 6 6 6 6 6 6 6 6 6 6 6 6 6 6 6 6 6 1 1 1 1 1 1 1 1 1 1 1 1 1 1 1 1
symmnumber: 1
zpe: 901820.7 jmol-1
zpe.correction: 0.343485 hartree
zpe.thermalcorrener: 0.362026 hartree
zpe.thermalcorrenthalpy: 0.362970 hartree
zpe.thermalcorrgfe: 0.296980 hartree
zpe.sumelectzpe: -1074.856577 hartree
zpe.sumelectthermal: -1074.838037 hartree
zpe.sumelectthermalent: -1074.837093 hartree
zpe.sumelectthermalfe: -1074.903082 hartree
dipole: 0.0000 0.0079 0.0002
dipole: 0.0079
quadrupole: -132.9681 -134.1849 -172.5597
quadrupole: -0.0001 -0.0046 -0.0010
quadrupole: 13.6028 12.3860 -25.9888 -0.0001 -0.0046 -0.0010
hfenergy: -1075.2000625 hartree
pointgroup: C01 [X(C28H16)]
dipole: 0.0000073 0.0031076 0.0000971 debye
polarizability: 602.8173356|0.0001203|402.6116841|-0.0109239|-0.0070377|108.8863932 unknown
InChI: InChI=1S/C28H16/c1-3-9-19-17(7-1)15-25-26-16-18-8-2-4-10-20(18)22-12-6-14-24(28(22)26)23-13-5-11-21(19)27(23)25/h1-16H
charge 0 multiplicity 1
44 atoms
C  -1.467537 0.817816 0.000024
C  1.467537 0.817819 -0.000331
C  -0.741409 -0.447617 -0.000226
C  0.741421 -0.447605 -0.000019
C  -0.740564 2.064592 0.000073
C  0.740566 2.064592 -0.00037
C  -2.915203 0.821866 0.000175
C  2.915205 0.821877 -0.000506
C  -3.654807 -0.440291 -0.000084
C  3.654811 -0.440269 -0.000213
C  -1.476736 -1.635653 -0.000555
C  1.476745 -1.635643 0.000497
C  -2.908119 -1.673069 -0.000505
C  2.908124 -1.673057 0.000409
C  -1.473697 3.274002 0.000567
C  1.473688 3.274009 -0.00076
C  -3.597286 2.073093 0.000614
C  3.597282 2.073105 -0.000868
C  -2.885772 3.279281 0.000838
C  2.88577 3.279292 -0.001046
C  -5.080701 -0.51927 0.000048
C  5.080702 -0.51924 -0.000439
C  -3.602637 -2.925377 -0.000805
C  3.602652 -2.925352 0.000879
C  -5.743892 -1.755522 -0.000237
C  5.743904 -1.755487 -0.000009
C  -5.000724 -2.971702 -0.000682
C  5.000742 -2.971673 0.000692
H  -0.96344 -2.601801 -0.000937
H  0.963437 -2.601786 0.001009
H  -0.956131 4.236354 0.000765
H  0.956123 4.23636 -0.000868
H  -4.690129 2.105816 0.000781
H  4.690125 2.105814 -0.000995
H  -3.425236 4.232421 0.001228
H  3.425214 4.232442 -0.001368
H  -5.683778 0.393614 0.00038
H  5.683781 0.393643 -0.000961
H  -3.020142 -3.854265 -0.00112
H  3.02018 -3.854255 0.001393
H  -6.8393 -1.783182 -0.000128
H  6.839314 -1.783144 -0.000209
H  -5.522109 -3.935189 -0.000898
H  5.522125 -3.935161 0.001068
