program: Gaussian 09
title: 000136010
version: EM64L-G09RevD.01
frameworkgroup: C1[X(C30H16)]
method: RPBEPBE
basis: SDD
operation: Freq
keyword: #p
keyword: freq=noraman
keyword: PBEPBE/SDD
title: #p freq=noraman PBEPBE/SDD
converged: NO YES NO YES
title: Mulliken charges:
elementType: C C C C C C C C C C C C C C C C C C C C C C C C C C C C C C H H H H H H H H H H H H H H H H
charge: 0.009190 -0.092415 -0.095401 -0.028930 0.491183 0.151186 0.223056 0.261940 0.287620 0.500107 0.258669 0.237128 0.201231 -0.913503 -0.435107 0.586062 -0.540945 -0.461156 -0.390171 -0.519849 -0.438346 -0.321551 -0.383996 -0.384570 -0.362200 -0.497332 -0.282041 -0.281370 -0.257868 -0.253477 0.233184 0.228483 0.243405 0.225025 0.234455 0.241649 0.232824 0.234523 0.231286 0.231109 0.224354 0.249406 0.231880 0.231955 0.228364 0.230954
chargesum: 0.00000
title: Mulliken charges with hydrogens summed into heavy atoms:
elementType: C C C C C C C C C C C C C C C C C C C C C C C C C C C C C C
charge: 0.009190 -0.092415 -0.095401 -0.028930 0.491183 0.151186 0.223056 0.261940 0.287620 0.500107 0.258669 0.237128 0.201231 -0.680318 -0.206624 0.586062 -0.297540 -0.236131 -0.155716 -0.278201 -0.205523 -0.087027 -0.152710 -0.153461 -0.137846 -0.247926 -0.050160 -0.049415 -0.029503 -0.022522
polarizability: 6.61844603e+02 -1.26267418e+01 3.90218512e+02 1.30271325e-02 7.57938038e-03 1.15249050e+02
1716.lowfreq: -5.9569 -0.0006 0.0002 0.0003 4.8826 6.0526 24.8724 56.1619 73.2317
frequency: 24.8715 56.1616 73.2307 89.1961 115.6219 142.0999 158.3652 175.3063 229.2885 246.3406 258.4520 265.7976 290.7058 329.8597 332.2460 341.8673 352.1157 406.4086 420.5137 423.0155 441.2890 441.5081 479.6269 496.3783 504.9306 527.7972 528.8759 546.8349 568.0702 577.9538 584.0506 585.9999 610.9724 619.7954 629.7105 634.7815 664.0698 677.5979 689.9775 711.9115 740.4987 757.6737 762.5449 767.1532 770.3354 783.4972 794.2187 795.6086 828.6085 855.9976 857.0360 867.7561 880.7832 890.8091 892.1772 922.4147 923.8947 943.9189 956.4316 961.3135 963.1482 981.2929 985.4079 987.4579 991.9172 999.4786 1009.4956 1036.9584 1043.0029 1057.4710 1066.3189 1087.5200 1088.4062 1110.2920 1139.1395 1150.9517 1172.8784 1176.9792 1184.9813 1192.8101 1216.6193 1238.1043 1246.4550 1255.6448 1268.3892 1280.2192 1284.0135 1306.6171 1314.2307 1334.1420 1342.6081 1371.8694 1378.9164 1388.4765 1401.4043 1409.4735 1412.8532 1418.2533 1432.2436 1438.0472 1446.6754 1459.9338 1473.7727 1481.7804 1495.3013 1518.8550 1526.3567 1551.8511 1578.2734 1587.2988 1594.8927 1601.0297 1612.0805 1618.3871 1622.3762 1626.0099 3120.8428 3127.0947 3129.0679 3130.5658 3133.1028 3134.4633 3142.9515 3146.0393 3150.4157 3157.1096 3162.2151 3163.3992 3168.1635 3169.4381 3174.0900 3177.1297
redmass: 5.5496 4.3250 4.8169 3.8521 4.5023 3.9899 5.5135 4.6913 4.1957 5.5868 4.0924 6.4184 3.9486 4.8925 5.8529 4.7955 6.8220 6.0321 6.9021 3.5334 6.7162 3.2878 3.5149 3.4079 5.2946 3.3832 5.9124 3.1554 7.8758 3.3256 7.5085 7.5827 3.5863 4.8761 6.8658 3.6359 6.6648 2.8013 6.5702 6.5598 2.0462 2.5023 1.3930 5.7988 1.3263 6.9783 1.6089 1.8534 2.5610 1.4864 5.5880 1.5746 1.8954 1.8103 6.2014 1.7624 7.1074 5.9699 1.4389 1.4400 1.4169 1.3828 1.4358 1.5320 1.3484 2.9555 6.8340 2.2269 4.1734 3.1672 2.5296 9.6937 3.1493 2.0101 1.7082 1.5039 1.3763 1.1163 1.1546 1.4167 1.4145 1.5317 2.2704 1.6501 1.7791 2.8062 1.7915 2.1304 2.8965 3.2927 2.8143 3.0806 4.4224 5.3966 4.5806 3.6550 5.7738 4.4478 3.8449 2.8443 3.3470 3.2088 2.7237 3.2702 3.8563 3.9693 4.0915 4.7005 7.7763 7.1580 5.8076 5.7825 6.3097 6.7042 6.6979 6.4445 1.0866 1.0886 1.0862 1.0874 1.0888 1.0869 1.0905 1.0901 1.0946 1.0944 1.0983 1.0938 1.0950 1.0948 1.0934 1.0946
irintensity: 0.0447 0.1838 0.3717 0.0016 3.8894 0.5326 0.3626 0.1773 0.3557 0.0359 0.7766 0.0807 0.8309 0.1796 0.2309 0.0206 0.3408 0.1252 1.3369 0.0618 0.4936 9.8555 3.0997 0.0131 1.0735 0.0212 2.4980 0.3910 1.6085 0.1047 3.0486 6.8325 11.6096 5.1774 3.1185 3.8666 1.5020 1.6264 0.4054 1.1587 7.9347 0.6123 54.9508 8.4627 119.1021 0.6850 42.6003 2.9279 28.4578 0.3430 0.2310 49.3758 0.0014 11.4466 0.2990 14.4216 1.7082 0.3417 0.1672 5.7476 0.5943 0.9690 0.0601 1.1996 0.8171 7.3634 5.0622 3.5284 3.3832 7.4108 2.8491 0.4361 1.2105 6.4729 0.0630 0.2816 2.7783 3.5272 1.8764 1.8741 8.6936 9.7463 6.4009 5.6798 10.7963 0.3089 1.2012 0.1465 2.4265 1.0820 10.7231 7.0850 6.1366 3.4214 2.7612 1.6523 1.0380 8.5816 5.6067 5.8252 0.3632 2.1027 37.2083 3.1999 5.1178 0.7076 0.3845 1.3107 3.8037 1.4710 3.1129 4.2005 3.8522 2.3343 0.0683 4.2647 2.3943 0.6465 5.2362 9.8634 8.3495 17.4737 7.8267 16.5691 16.8930 3.5423 22.0719 3.7905 5.1463 62.4791 68.2371 37.0490
temp: 298.150 k
press: 1.00000 atm
elementType: 6 6 6 6 6 6 6 6 6 6 6 6 6 6 6 6 6 6 6 6 6 6 6 6 6 6 6 6 6 6 1 1 1 1 1 1 1 1 1 1 1 1 1 1 1 1
symmnumber: 1
zpe: 936387.2 jmol-1
zpe.correction: 0.356651 hartree
zpe.thermalcorrener: 0.375869 hartree
zpe.thermalcorrenthalpy: 0.376813 hartree
zpe.thermalcorrgfe: 0.309850 hartree
zpe.sumelectzpe: -1150.987337 hartree
zpe.sumelectthermal: -1150.968119 hartree
zpe.sumelectthermalent: -1150.967175 hartree
zpe.sumelectthermalfe: -1151.034138 hartree
dipole: -0.0238 -0.0223 0.0003
dipole: 0.0327
quadrupole: -141.5012 -143.2109 -183.4982
quadrupole: 0.0759 0.0002 0.0013
quadrupole: 14.5689 12.8592 -27.4281 0.0759 0.0002 0.0013
hfenergy: -1151.3439882 hartree
pointgroup: C01 [X(C30H16)]
dipole: 0.0093843 -0.0087753 -0.0001321 debye
polarizability: 661.8320105|12.7614668|390.2311049|0.0130309|-0.0075729|115.24905 unknown
InChI: InChI=1S/C30H16/c1-2-7-19-18(6-1)16-26-23-11-5-10-22-20-8-3-4-9-21(20)25-15-13-17-12-14-24(19)29(26)27(17)30(25)28(22)23/h1-16H
charge 0 multiplicity 1
46 atoms
C  1.103901 0.552711 -0.000017
C  -0.186373 1.207216 0.000038
C  1.173689 -0.902971 0.000073
C  -1.413506 0.444069 -0.00004
C  -1.355565 -1.008331 -0.000037
C  -0.040011 -1.68147 0.000163
C  2.304136 1.334402 -0.000073
C  2.456401 -1.561172 0.000125
C  -2.684993 1.118965 -0.000154
C  -0.250937 2.643932 0.000096
C  3.616069 0.672584 -0.00029
C  3.692743 -0.761977 -0.000172
C  -3.920866 0.350382 -0.000412
C  -2.557291 -1.726833 -0.000267
C  2.195737 2.763275 0.000056
C  -3.836273 -1.091726 -0.000482
C  0.960585 3.399621 0.000146
C  -2.7025 2.557932 -0.000041
C  0.059426 -3.09508 0.000466
C  -1.5297 3.294051 0.000107
C  2.494881 -2.981408 0.000415
C  1.311282 -3.737269 0.000612
C  4.831866 1.422943 -0.00068
C  4.98072 -1.377385 -0.000453
C  -5.222654 0.947178 -0.000679
C  -5.038874 -1.873701 -0.000754
C  6.08474 0.796468 -0.000911
C  6.160208 -0.621007 -0.000783
C  -6.382287 0.164127 -0.000957
C  -6.292931 -1.261672 -0.00097
H  -2.550268 -2.820785 -0.000347
H  3.098364 3.378597 0.000103
H  0.902314 4.494049 0.000248
H  -3.658382 3.088262 -0.00004
H  -0.841814 -3.712823 0.000625
H  -1.562718 4.389565 0.000224
H  3.451048 -3.50975 0.000513
H  1.362019 -4.831258 0.000881
H  4.800381 2.515248 -0.00084
H  5.066051 -2.467003 -0.000425
H  -5.327944 2.035951 -0.000719
H  -4.955345 -2.967037 -0.000796
H  6.999486 1.399001 -0.001214
H  7.133611 -1.123253 -0.00098
H  -7.365602 0.647299 -0.001177
H  -7.205722 -1.867116 -0.00118
