program: Gaussian 09
title: 000136004
version: EM64L-G09RevD.01
frameworkgroup: C1[X(C36H16)]
method: RPBEPBE
basis: SDD
operation: Freq
keyword: #p
keyword: freq=noraman
keyword: PBEPBE/SDD
title: #p freq=noraman PBEPBE/SDD
converged: NO NO NO NO
title: Mulliken charges:
elementType: C C C C C C C C C C C C C C C C C C C C C C C C C C C C C C C C C C C C H H H H H H H H H H H H H H H H
charge: 0.103590 0.103572 0.072718 0.072789 -0.152582 -0.152649 -0.143702 -0.143714 0.248468 0.248489 -0.040611 -0.040651 0.543683 0.543682 0.437066 0.437021 0.530458 0.530487 -0.814539 -0.814535 -0.439279 -0.439280 0.468886 0.468912 -0.552282 -0.552280 -0.498747 -0.498752 -0.440329 -0.440337 -0.485325 -0.485327 -0.479206 -0.479198 -0.271479 -0.271480 0.249191 0.249192 0.232339 0.232336 0.244160 0.244160 0.243344 0.243346 0.235732 0.235730 0.236751 0.236752 0.242135 0.242132 0.229581 0.229582
chargesum: 0.00000
title: Mulliken charges with hydrogens summed into heavy atoms:
elementType: C C C C C C C C C C C C C C C C C C C C C C C C C C C C C C C C C C C C
charge: 0.103590 0.103572 0.072718 0.072789 -0.152582 -0.152649 -0.143702 -0.143714 0.248468 0.248489 -0.040611 -0.040651 0.543683 0.543682 0.437066 0.437021 0.530458 0.530487 -0.565348 -0.565343 -0.206940 -0.206944 0.468886 0.468912 -0.308122 -0.308120 -0.255403 -0.255406 -0.204598 -0.204606 -0.248573 -0.248575 -0.237071 -0.237067 -0.041898 -0.041898
polarizability: 8.28409408e+02 4.12108403e+01 5.16833747e+02 2.60975442e-05 3.31494610e-03 1.35175295e+02
1716.lowfreq: -8.2504 -0.0011 0.0003 0.0011 8.8011 11.8073 39.1498 52.0515 78.7080
frequency: 39.1498 52.0515 78.7079 115.5459 117.3133 163.8548 187.4925 191.2205 199.3858 218.0615 258.7678 261.1329 290.9373 296.4909 317.1377 325.8519 343.4072 364.6095 376.3693 382.8627 406.4184 406.8079 421.4293 440.8258 475.4061 482.9892 486.6281 488.3717 488.7545 528.4150 539.5620 541.1565 542.0384 555.5077 559.5834 575.6453 580.2994 604.6060 607.6429 621.1372 635.0014 635.8270 652.9377 659.9492 695.3961 707.8346 736.8489 744.2302 745.8719 749.8794 763.5455 767.5767 780.2800 791.8609 799.2051 810.0631 815.8958 828.9683 840.7548 849.2566 853.3028 882.1729 890.0001 908.4337 913.5606 918.0211 925.6413 930.8876 944.3598 961.8780 975.9535 978.4143 980.9501 984.3567 990.1549 991.8259 997.8711 1000.7105 1011.6705 1063.9315 1083.5265 1087.1048 1109.7665 1110.0404 1113.3266 1152.5002 1158.0497 1168.6002 1187.1301 1192.5591 1195.8318 1204.8609 1214.1147 1215.6440 1241.6579 1243.3015 1281.2080 1282.7650 1292.7879 1299.7826 1313.6087 1315.4924 1329.7934 1366.5738 1381.3282 1384.7209 1395.0974 1398.8163 1410.0101 1411.3917 1418.8584 1420.9199 1428.8707 1433.1707 1435.0619 1446.7900 1451.7870 1462.3190 1477.8824 1492.8110 1492.9312 1501.2825 1521.8541 1532.7301 1554.3325 1570.2890 1583.5600 1587.8189 1596.3315 1604.2210 1610.3418 1613.8213 1628.3365 1629.8693 3120.5854 3120.6006 3122.8255 3122.8607 3123.7798 3123.7999 3128.4039 3128.5630 3142.3841 3142.4301 3145.7435 3145.9599 3157.2235 3157.2887 3168.1521 3168.3461
redmass: 5.9053 5.2941 4.8728 4.8854 5.3899 4.6156 4.3939 5.9715 4.6263 3.7896 7.5924 5.1563 6.9742 5.1229 5.0933 4.4144 6.4968 4.5493 7.0055 5.7567 6.4576 7.0389 3.8760 5.4410 3.8525 5.5456 6.4022 4.1154 5.4532 6.8753 3.3563 6.4155 3.3986 4.0848 6.9384 5.4954 3.7957 3.6995 7.7063 4.5098 8.3729 7.0504 6.7701 3.5396 3.1558 2.9219 6.5258 1.9340 5.8657 5.7773 1.9613 7.5526 1.4411 1.8306 7.1419 7.0792 1.9013 1.5598 2.6275 1.5462 2.0460 3.0515 5.8019 6.3469 1.5229 1.6479 1.7909 1.8592 6.6026 6.1898 1.4078 1.4909 1.4133 1.3943 1.4198 1.4598 5.9618 4.5797 6.6161 4.5819 2.5356 2.0706 2.9012 2.2604 11.5374 1.6925 1.4715 1.2159 1.9459 1.3977 1.3651 1.5854 1.3251 1.5966 1.6916 1.7016 2.1925 2.5033 3.8645 2.2023 3.4534 3.1189 2.7253 3.8149 5.4228 5.0173 5.3873 9.2335 3.6049 5.5470 2.0258 3.0601 4.3499 5.9617 4.7092 4.0782 4.9444 7.3052 3.3265 3.8829 5.6781 5.5949 4.0914 6.5323 8.7301 5.4543 5.1744 7.9602 6.6788 6.4463 7.0759 7.4501 7.3298 7.2570 1.0872 1.0872 1.0902 1.0903 1.0867 1.0868 1.0880 1.0880 1.0925 1.0924 1.0979 1.0976 1.0973 1.0973 1.0936 1.0936
irintensity: 0.2872 0.0656 0.0000 6.0013 0.0000 0.4532 0.3859 1.6230 0.0000 0.0000 0.0000 5.7761 0.0000 0.0000 0.0000 0.7630 0.0000 0.2126 0.9816 0.0000 1.0598 0.0000 0.0000 4.7249 0.9997 0.0000 0.7617 0.0000 0.0000 1.9513 0.4544 0.0000 0.0000 9.2858 0.0000 5.7195 0.0353 12.9473 0.0000 0.0000 0.0000 1.4274 0.2607 0.0000 0.0000 5.2053 3.5807 0.0000 0.9717 0.0000 72.1548 0.0000 0.0000 0.0003 0.0000 0.8331 0.0000 94.4946 46.2017 0.0000 0.0149 0.0000 0.0000 5.0268 11.8540 0.0000 115.5191 0.0001 1.7984 0.0000 0.0000 11.3087 11.3378 0.0000 0.0000 1.8737 4.4296 0.0000 0.4193 0.0000 9.5521 0.0000 0.0002 5.9688 0.0000 8.9824 0.0000 8.0042 4.8202 0.0000 0.0000 14.0014 0.0000 17.6273 0.9176 0.0000 0.0000 8.9890 7.4168 0.0000 0.0001 12.2308 2.6768 0.0000 7.3112 0.0000 0.0000 1.8254 0.0000 1.3262 4.9804 0.0000 7.9932 0.0000 20.1251 0.0000 0.0000 2.2008 8.3780 0.8020 0.0001 0.0000 0.0000 6.9596 2.4608 0.0000 7.9355 0.0000 4.9305 0.0000 13.4743 0.0000 0.0000 9.0383 1.2154 0.0600 19.0995 0.7536 0.0941 1.3231 23.2786 0.0047 0.6686 42.6222 111.9468 0.0065 0.5820 17.1655 105.1377 0.5667
temp: 298.150 k
press: 1.00000 atm
elementType: 6 6 6 6 6 6 6 6 6 6 6 6 6 6 6 6 6 6 6 6 6 6 6 6 6 6 6 6 6 6 6 6 6 6 6 6 1 1 1 1 1 1 1 1 1 1 1 1 1 1 1 1
symmnumber: 1
zpe: 1036596.4 jmol-1
zpe.correction: 0.394819 hartree
zpe.thermalcorrener: 0.416045 hartree
zpe.thermalcorrenthalpy: 0.416989 hartree
zpe.thermalcorrgfe: 0.347111 hartree
zpe.sumelectzpe: -1379.360471 hartree
zpe.sumelectthermal: -1379.339245 hartree
zpe.sumelectthermalent: -1379.338300 hartree
zpe.sumelectthermalfe: -1379.408179 hartree
dipole: 0.0000 0.0000 0.0003
dipole: 0.0003
quadrupole: -168.2450 -170.1756 -216.4663
quadrupole: 0.0569 -0.0003 0.0005
quadrupole: 16.7173 14.7867 -31.5040 0.0569 -0.0003 0.0005
hfenergy: -1379.7552898 hartree
pointgroup: C01 [X(C36H16)]
dipole: 0.0000036 -0.0000114 0.0001334 debye
polarizability: 828.1894582|42.0335118|517.053697|0.0000173|0.003315|135.1752954 unknown
InChI: InChI=1S/C36H16/c1-3-17-7-9-19-15-22-12-14-26-24-6-2-4-18-8-10-20-16-21-11-13-25-23(5-1)27(17)29(19)35-32(22)34(26)36(30(20)28(18)24)31(21)33(25)35/h1-16H
charge 0 multiplicity 1
52 atoms
C  -1.365166 0.463621 -0.000138
C  1.365156 -0.463616 -0.000139
C  -1.089727 -0.959233 -0.000098
C  1.089713 0.959223 -0.000112
C  -0.282107 1.406847 -0.000108
C  0.282086 -1.406855 -0.000138
C  -2.723738 0.925352 -0.000127
C  2.723711 -0.925361 -0.00015
C  -2.165164 -1.90838 -0.000104
C  2.165155 1.908373 -0.000077
C  -3.811276 -0.018264 -0.000114
C  3.811266 0.018255 -0.000121
C  -0.575083 2.822709 -0.00006
C  0.57507 -2.822707 -0.000104
C  -3.549092 -1.437992 -0.000117
C  3.549074 1.437977 -0.000066
C  -2.999566 2.349012 -0.00012
C  2.99956 -2.349025 -0.000173
C  -1.924937 3.262462 -0.000085
C  1.924922 -3.26247 -0.000139
C  -1.836293 -3.30757 -0.000029
C  1.836289 3.307553 -0.000002
C  -5.174099 0.467214 -0.000122
C  5.174078 -0.467234 -0.000124
C  0.520085 3.75026 -0.000032
C  -0.520089 -3.750266 -0.000042
C  -4.373968 2.79808 -0.000119
C  4.373948 -2.798075 -0.000174
C  -4.661591 -2.328082 -0.00009
C  4.661568 2.328073 0.000022
C  -5.417416 1.893373 -0.000106
C  5.417397 -1.893371 -0.000159
C  -6.246133 -0.4614 -0.000068
C  6.246115 0.461399 -0.00007
C  -5.985828 -1.847771 -0.00005
C  5.985811 1.847759 -0.000017
H  -2.135404 4.338954 -0.000055
H  2.135369 -4.338964 -0.000113
H  -2.635446 -4.053592 0.000034
H  2.635442 4.053582 0.00007
H  0.305102 4.824957 0.000022
H  -0.305103 -4.824963 0.000009
H  -4.576051 3.875344 -0.000095
H  4.576048 -3.875334 -0.000186
H  -4.501546 -3.409581 -0.000026
H  4.501525 3.409576 0.000093
H  -6.455061 2.247037 -0.000084
H  6.455032 -2.247065 -0.000193
H  -7.278177 -0.091152 -0.000059
H  7.278158 0.09114 -0.000077
H  -6.818197 -2.559981 -0.000017
H  6.818174 2.559973 0.000049
