program: Gaussian 09
title: 000011713
version: EM64L-G09RevD.01
frameworkgroup: C1[X(C3H7BrO)]
method: RPBEPBE
basis: SDD
operation: Freq
keyword: #p
keyword: freq=noraman
keyword: PBEPBE/SDD
title: #p freq=noraman PBEPBE/SDD
converged: YES YES NO NO
title: Mulliken charges:
elementType: Br O C C C H H H H H H H
charge: -0.066763 -0.424444 -0.410184 -0.275139 -0.632777 0.304735 0.216459 0.224579 0.223933 0.252897 0.239766 0.346937
chargesum: 0.00000
title: Mulliken charges with hydrogens summed into heavy atoms:
elementType: Br O C C C
charge: -0.066763 -0.077507 -0.105449 0.165899 0.083820
polarizability: 6.54843756e+01 9.37619188e+00 5.36615506e+01 -2.57309044e+00 -1.24831342e+00 3.54932466e+01
1716.lowfreq: -11.1053 -0.0003 0.0003 0.0004 12.7882 22.2048 127.0349 195.7757 225.2528
frequency: 127.0260 195.7732 225.2460 266.3809 340.7289 401.2141 464.7813 504.9362 872.8014 914.0325 1006.6973 1009.7984 1089.0371 1127.8757 1155.0000 1237.4871 1285.4521 1335.3857 1376.8839 1396.8592 1447.3253 1461.8267 1474.6316 2967.0228 2980.5266 3049.1085 3071.5080 3087.0410 3113.3849 3523.3665
redmass: 3.8424 2.7625 1.1529 2.5970 2.7904 1.1897 4.1889 2.5565 2.0640 1.2785 5.5204 1.3951 2.3448 1.6689 1.2603 1.2857 1.3641 1.2240 1.2678 1.1965 1.0782 1.0487 1.0481 1.0631 1.0402 1.0973 1.0934 1.0905 1.0997 1.0654
irintensity: 6.8309 0.4242 1.2016 3.7039 10.6938 160.0219 5.1423 54.1071 13.4763 12.7585 84.9602 32.2640 7.0634 13.2875 21.1306 61.6805 3.4604 18.2718 11.5257 27.4193 2.0804 16.2362 10.0031 44.8776 21.9142 13.0041 5.6516 19.8231 21.9400 5.7757
temp: 298.150 k
press: 1.00000 atm
elementType: 35 8 6 6 6 1 1 1 1 1 1 1
symmnumber: 1
zpe: 254261.1 jmol-1
zpe.correction: 0.096843 hartree
zpe.thermalcorrener: 0.103385 hartree
zpe.thermalcorrenthalpy: 0.104329 hartree
zpe.thermalcorrgfe: 0.065642 hartree
zpe.sumelectzpe: -206.767457 hartree
zpe.sumelectthermal: -206.760915 hartree
zpe.sumelectthermalent: -206.759971 hartree
zpe.sumelectthermalfe: -206.798657 hartree
dipole: 0.5305 2.2484 0.3943
dipole: 2.3435
quadrupole: -45.5045 -38.7774 -40.5826
quadrupole: 5.9329 0.9741 -1.4800
quadrupole: -3.8830 2.8441 1.0389 5.9329 0.9741 -1.4800
hfenergy: -206.8642996 hartree
pointgroup: C01 [X(C3H7Br1O1)]
dipole: 0.6738634 -0.6181804 0.1177248 debye
dipolederiv: -0.2657638 -0.0118268 0.0158909 -0.0029067 -0.6798318 -0.022659 0.0220176 -0.1087841 -0.1733949 -0.8334961 0.0742615 0.0363998 0.1283896 -0.2577394 0.1558174 0.0418806 0.1392622 -0.5211061 0.1031907 -0.016376 -0.0163828 -0.0416159 1.0146119 0.1375416 0.0175868 0.1987158 0.117822 0.5686332 -0.0298088 0.1056643 -0.1822379 0.0703396 -0.0674866 0.0179834 -0.1259009 0.3493489 -0.1365962 0.0192365 -0.0234324 0.0913725 -0.1617548 0.0099414 0.0353388 -0.0452294 0.0463775 0.0411188 0.0023747 -0.0343068 -0.0122844 -0.0750558 -0.0447427 -0.01323 -0.0122009 -0.0808643 -0.0159253 0.0295922 -0.075547 0.0186365 0.0860631 -0.0235991 -0.0551589 0.0464623 -0.1848546 0.0286622 -0.0503411 -0.0056758 0.0345574 -0.1207103 -0.0323026 0.0093189 -0.0295182 0.087608 0.0738664 0.0326338 -0.0167905 0.0233147 -0.1420003 -0.0719089 -0.0241629 -0.0464865 0.0946095 -0.0562073 -0.0429314 0.0664842 -0.0855216 0.0759097 0.0522025 0.073134 0.0518146 0.0638626 0.0894743 0.019234 0.0091942 0.0017794 0.1105705 -0.0108505 -0.0533295 0.0250342 -0.1199629 0.4030434 -0.0260484 -0.0614981 0.0265164 0.0795976 -0.0819535 -0.0713791 -0.0931691 0.3205543 unknown
polarizability: 48.490249|0.0409385|70.2442094|0.0780035|4.7435683|35.9047143 unknown
InChI: InChI=1S/C3H7BrO/c1-3(4)2-5/h3,5H,2H2,1H3
charge 0 multiplicity 1
12 atoms
Br 0.391579 1.746355 0.19618
O  -2.148003 -0.348803 -0.098989
C  0.343353 -0.257309 -0.32999
C  -0.873492 -0.887992 0.361105
C  1.677944 -0.900103 0.043131
H  0.183889 -0.202111 -1.419188
H  -0.761123 -0.807712 1.462902
H  -0.906472 -1.959121 0.087159
H  1.679796 -1.957108 -0.290346
H  2.52189 -0.385679 -0.444025
H  1.842373 -0.881234 1.134538
H  -2.164834 0.624218 0.099923
