program: Gaussian 09
title: 000135994
version: EM64L-G09RevD.01
frameworkgroup: C1[X(C34H18)]
method: RPBEPBE
basis: SDD
operation: Freq
keyword: #p
keyword: freq=noraman
keyword: PBEPBE/SDD
title: #p freq=noraman PBEPBE/SDD
converged: YES YES NO YES
title: Mulliken charges:
elementType: C C C C C C C C C C C C C C C C C C C C C C C C C C C C C C C C C C H H H H H H H H H H H H H H H H H H
charge: -0.090558 -0.090410 -0.008009 -0.008188 0.335012 0.335016 0.214054 0.213968 0.341762 0.341840 -0.196675 -0.196636 0.268171 0.268204 -0.483219 -0.483218 0.463481 0.463495 -0.430570 -0.430641 -0.481058 -0.481197 -0.412136 -0.412138 -0.463861 -0.463871 -0.475124 -0.475126 -0.258041 -0.258102 -0.261953 -0.261957 -0.281131 -0.281199 0.229571 0.229574 0.290834 0.290890 0.297568 0.297645 0.231584 0.231586 0.240011 0.240011 0.239362 0.239362 0.230617 0.230619 0.228959 0.228959 0.231429 0.231431
chargesum: 0.00000
title: Mulliken charges with hydrogens summed into heavy atoms:
elementType: C C C C C C C C C C C C C C C C C C C C C C C C C C C C C C C C C C
charge: -0.090558 -0.090410 -0.008009 -0.008188 0.335012 0.335016 0.214054 0.213968 0.341762 0.341840 -0.196675 -0.196636 0.268171 0.268204 -0.253648 -0.253645 0.463481 0.463495 -0.139736 -0.139750 -0.183490 -0.183552 -0.180552 -0.180553 -0.223850 -0.223860 -0.235762 -0.235764 -0.027423 -0.027482 -0.032994 -0.032998 -0.049702 -0.049768
polarizability: 8.93743109e+02 5.91278770e-04 4.80309042e+02 -1.35558512e-03 1.90480935e+01 1.65017358e+02
1716.lowfreq: -7.5786 -4.1196 -0.0004 -0.0003 0.0002 3.5014 38.7858 39.4234 73.1001
frequency: 38.7845 39.4142 73.0988 97.9443 101.1357 121.3027 124.5649 178.9175 181.6778 189.1728 213.1842 230.4007 263.5362 273.0016 273.9095 282.5304 319.6978 327.8860 352.0444 405.5160 410.2820 413.3693 415.0133 460.1776 467.3246 473.9776 477.7591 479.8044 490.1320 492.7656 513.9654 518.3852 535.5348 539.7043 568.9114 574.2216 594.3420 605.7241 618.5915 621.4047 630.3971 649.1503 661.3971 665.4703 689.3690 699.0891 728.9515 758.2106 758.3723 762.0334 763.3411 771.4628 775.9866 781.9043 790.2872 791.1783 795.3059 819.3219 836.0009 839.0745 849.1923 875.1109 879.5567 898.3536 903.0697 907.1250 924.5569 928.3242 932.3610 957.6899 962.7764 969.5192 975.9493 981.0480 983.1167 999.8543 1007.5327 1029.7920 1040.8578 1045.2646 1054.5964 1087.8385 1092.6672 1097.7014 1102.2688 1144.9895 1157.4100 1160.4676 1179.3114 1187.1434 1191.1842 1200.9234 1211.5555 1218.6948 1223.3826 1239.3997 1241.3331 1275.7268 1294.9795 1304.8744 1314.4106 1316.3562 1348.5066 1350.3752 1372.6852 1374.2454 1386.0115 1389.6634 1395.5798 1402.3059 1409.5232 1410.2897 1427.2669 1431.1627 1439.8072 1455.1602 1460.4954 1461.6613 1479.4748 1496.0887 1515.1421 1526.8575 1546.5130 1550.3346 1572.8980 1578.3956 1584.6006 1586.8716 1591.0934 1613.5272 1614.5817 1615.6694 3125.8134 3125.9088 3127.1810 3127.3096 3129.2777 3138.1859 3142.7849 3144.7573 3146.3692 3147.4286 3148.5944 3159.6759 3161.4291 3162.9124 3165.8985 3167.1618 3170.7938 3174.1940
redmass: 5.7873 4.9502 5.1885 4.6366 4.7371 5.2490 4.4895 4.7302 4.1728 4.2672 4.2869 6.5676 4.6710 5.3797 6.0142 5.1063 4.2787 6.1060 6.1675 5.3274 4.5487 5.3987 5.7038 5.3867 3.4734 4.7396 4.6443 4.2864 4.0756 4.1699 4.0359 6.6722 6.5224 6.9388 4.7652 6.8119 4.0424 4.1703 4.5880 8.0203 6.2421 5.5498 2.6374 4.0742 5.2359 4.0489 6.6368 3.5335 5.6151 1.6282 1.6756 1.4584 2.9002 1.5753 4.7187 4.5996 2.8760 6.4492 1.5932 2.3694 2.3922 1.7275 4.1241 1.5436 1.4472 4.3256 1.4960 4.6459 1.5614 1.5123 4.4337 1.3527 1.3456 1.3768 1.3713 1.3319 1.2988 3.9790 3.4714 4.0476 2.5111 2.2337 2.2367 2.1991 1.9246 1.6108 1.3838 1.6170 1.1454 1.2414 1.3749 1.4311 1.5464 1.5631 1.8862 1.8724 1.8348 1.6607 2.4456 3.3718 3.4610 1.9356 6.6059 2.9318 2.0527 6.4687 4.1444 4.1092 5.6254 3.0141 8.1092 5.8769 2.3845 2.7306 3.8810 3.6548 2.5451 3.1959 3.2894 5.4458 4.5060 4.8481 5.7988 6.1771 5.3897 5.1851 6.0982 5.5325 7.5497 6.7332 6.7391 6.4063 1.0864 1.0865 1.0860 1.0860 1.0856 1.0889 1.0918 1.0903 1.0911 1.0919 1.0932 1.0984 1.0956 1.0971 1.0976 1.0949 1.0948 1.0972
irintensity: 0.3140 0.0004 0.3539 1.8069 0.0008 0.5297 1.9528 0.1624 2.6828 0.0382 0.9444 3.7027 0.0463 0.3612 1.9609 2.0619 0.5973 0.9219 0.0010 0.0000 0.1649 0.9540 0.4238 7.2091 2.7460 0.1230 3.0194 0.0009 0.1005 0.4612 0.8755 1.6035 1.0766 0.1124 5.1869 1.6094 12.0881 1.3345 1.9277 2.7567 3.4414 1.1336 6.1134 0.4322 0.2811 1.5484 4.2044 1.3968 1.0719 0.2667 140.4603 12.0960 0.2628 18.8145 0.6151 10.3913 1.8995 1.6807 178.0460 1.8957 7.8542 2.6855 8.0502 1.3287 1.1552 1.6221 2.4437 0.4554 0.1555 1.5050 8.7508 0.5747 0.0009 2.5229 0.2276 2.1443 1.6664 1.8380 2.1112 0.0216 15.9610 0.9078 2.4777 8.1070 1.2155 1.1807 5.7524 4.6544 0.2308 1.1195 1.1028 0.0077 10.3332 2.4016 11.4948 0.9577 2.3108 0.0504 0.2690 3.7617 3.0908 0.4867 4.3705 46.6721 16.8024 1.0197 1.5848 1.2664 4.2374 9.8873 0.0542 0.4889 0.5870 2.2849 4.9467 3.7268 0.2408 1.1126 4.9641 0.8905 16.7848 0.0362 0.8814 0.3720 35.7693 0.8703 2.4736 0.5062 0.1365 7.8525 1.4138 9.7575 0.2316 5.3491 2.0989 0.0751 6.0773 37.5888 1.7108 8.1916 2.4683 99.7156 23.2551 9.5292 0.2455 43.2545 17.0956 50.3223 13.6280 28.5197
temp: 298.150 k
press: 1.00000 atm
elementType: 6 6 6 6 6 6 6 6 6 6 6 6 6 6 6 6 6 6 6 6 6 6 6 6 6 6 6 6 6 6 6 6 6 6 1 1 1 1 1 1 1 1 1 1 1 1 1 1 1 1 1 1
symmnumber: 1
zpe: 1051075.8 jmol-1
zpe.correction: 0.400334 hartree
zpe.thermalcorrener: 0.422383 hartree
zpe.thermalcorrenthalpy: 0.423327 hartree
zpe.thermalcorrgfe: 0.351132 hartree
zpe.sumelectzpe: -1304.338118 hartree
zpe.sumelectthermal: -1304.316069 hartree
zpe.sumelectthermalent: -1304.315125 hartree
zpe.sumelectthermalfe: -1304.387320 hartree
dipole: 0.0001 -0.1038 0.0374
dipole: 0.1103
quadrupole: -162.3098 -166.0493 -202.7074
quadrupole: -0.0013 0.0010 4.0127
quadrupole: 14.7124 10.9729 -25.6852 -0.0013 0.0010 4.0127
hfenergy: -1304.7384515 hartree
pointgroup: C01 [X(C34H18)]
dipole: 0.0000371 -0.0410417 0.0141271 debye
polarizability: 893.7431089|-0.0141191|479.7078927|0.0068001|23.4948075|165.6185078 unknown
InChI: InChI=1S/C34H18/c1-2-12-24-23(11-1)31-27-15-5-9-19-7-3-13-21(29(19)27)25-17-18-26-22-14-4-8-20-10-6-16-28(30(20)22)32(24)34(26)33(25)31/h1-18H
charge 0 multiplicity 1
52 atoms
C  0.72791 -0.466091 -0.124022
C  -0.727847 -0.466085 -0.12399
C  1.443985 0.770358 -0.014069
C  -1.44389 0.770372 -0.014018
C  1.447731 -1.718427 -0.220353
C  -1.447705 -1.718405 -0.220271
C  0.729094 1.990716 -0.313813
C  -0.729015 1.99072 -0.313725
C  2.870499 0.728506 0.344752
C  -2.870422 0.728604 0.344671
C  3.604397 -0.503083 0.158539
C  -3.604349 -0.502978 0.158554
C  2.920607 -1.716746 -0.210996
C  -2.920584 -1.716695 -0.210858
C  0.70429 -2.913502 -0.311333
C  -0.704289 -2.913493 -0.311284
C  5.036071 -0.52602 0.371075
C  -5.036038 -0.525825 0.370994
C  1.408232 3.190069 -0.728772
C  -1.40826 3.190098 -0.728411
C  3.552886 1.831698 0.915233
C  -3.552822 1.831974 0.914777
C  3.688108 -2.873075 -0.4833
C  -3.688117 -2.873022 -0.483079
C  5.692914 0.645886 0.870086
C  -5.692873 0.646196 0.869753
C  5.767494 -1.726112 0.099734
C  -5.767488 -1.725927 0.099771
C  4.948718 1.788699 1.176595
C  -4.948675 1.78907 1.176041
C  5.100134 -2.873217 -0.344104
C  -5.100147 -2.873105 -0.343912
C  0.713882 4.340842 -1.098206
C  -0.713994 4.34087 -1.097992
H  1.222062 -3.875303 -0.362718
H  -1.22208 -3.875285 -0.362645
H  2.495488 3.169754 -0.833604
H  -2.495557 3.169799 -0.832881
H  2.992529 2.727573 1.193865
H  -2.992461 2.727943 1.193123
H  3.196527 -3.796257 -0.804031
H  -3.19656 -3.796246 -0.803723
H  6.776247 0.619859 1.03487
H  -6.776223 0.620246 1.034434
H  6.85359 -1.731598 0.247163
H  -6.853593 -1.731352 0.24713
H  5.438112 2.664415 1.61626
H  -5.438089 2.664916 1.615426
H  5.662854 -3.785676 -0.568773
H  -5.662891 -3.785566 -0.568515
H  1.261901 5.22423 -1.443469
H  -1.26209 5.224278 -1.443079
