program: Gaussian 09
title: 000135991
version: EM64L-G09RevD.01
frameworkgroup: C1[X(C38H20)]
method: RPBEPBE
basis: SDD
operation: Freq
keyword: #p
keyword: freq=noraman
keyword: PBEPBE/SDD
title: #p freq=noraman PBEPBE/SDD
converged: YES YES NO NO
title: Mulliken charges:
elementType: C C C C C C C C C C C C C C C C C C C C C C C C C C C C C C C C C C C C C C H H H H H H H H H H H H H H H H H H H H
charge: -0.136095 -0.136091 0.000309 0.000270 0.000287 0.000302 0.235030 0.235023 0.235011 0.235013 0.343260 0.343254 0.343249 0.343267 -0.166353 -0.166350 0.422432 0.422436 -0.439686 -0.439689 -0.439680 -0.439679 -0.467527 -0.467534 -0.467527 -0.467526 -0.466817 -0.466817 -0.466815 -0.466817 -0.269774 -0.269781 -0.269774 -0.269771 -0.279675 -0.279684 -0.279677 -0.279674 0.289107 0.289110 0.289105 0.289105 0.292864 0.292869 0.292866 0.292863 0.239989 0.239989 0.239989 0.239989 0.231331 0.231331 0.231332 0.231331 0.231624 0.231624 0.231624 0.231625
chargesum: 0.00000
title: Mulliken charges with hydrogens summed into heavy atoms:
elementType: C C C C C C C C C C C C C C C C C C C C C C C C C C C C C C C C C C C C C C
charge: -0.136095 -0.136091 0.000309 0.000270 0.000287 0.000302 0.235030 0.235023 0.235011 0.235013 0.343260 0.343254 0.343249 0.343267 -0.166353 -0.166350 0.422432 0.422436 -0.150579 -0.150579 -0.150575 -0.150574 -0.174663 -0.174665 -0.174661 -0.174663 -0.226828 -0.226828 -0.226826 -0.226827 -0.038443 -0.038450 -0.038442 -0.038440 -0.048051 -0.048059 -0.048052 -0.048049
polarizability: 9.47048560e+02 4.55668408e-04 5.86448821e+02 1.44528165e-02 -2.75884134e-03 2.32195616e+02
1716.lowfreq: -8.2054 -7.4303 -2.9645 -0.0004 0.0002 0.0005 38.2353 40.9541 67.1377
frequency: 38.2231 40.9541 67.1377 67.6479 95.6835 112.5243 127.0209 134.5138 168.8068 172.6948 177.3089 194.7429 228.8361 246.1823 263.1696 270.3303 271.7137 273.9842 281.4370 308.7592 342.5898 343.2926 361.9253 411.3463 414.9359 425.5105 445.9067 453.6093 464.6487 469.5941 481.1590 495.0002 497.5666 500.3444 508.6466 518.4261 527.6116 535.3117 568.0156 578.0194 591.1823 591.4741 602.3971 610.5133 620.6697 627.1849 635.5872 664.8153 672.4821 679.4507 689.7485 696.8510 698.4180 736.7438 749.1363 753.2553 760.9362 771.1532 773.5907 775.0780 779.5441 780.7111 788.6078 791.0758 792.4642 823.7154 841.6080 842.9770 869.9020 869.9952 876.3307 880.7922 905.0713 913.9236 920.0377 924.0520 934.8615 967.4973 971.2064 974.7869 979.9216 981.5079 996.6119 1005.0192 1005.2717 1006.5057 1014.3178 1033.7055 1047.8876 1049.8132 1054.4302 1059.7499 1093.4539 1103.3273 1112.1639 1119.4664 1122.0921 1148.4843 1165.2912 1176.3558 1179.7332 1185.8817 1197.6263 1197.7978 1207.3302 1225.1403 1226.1169 1241.5519 1244.4097 1248.8991 1292.0606 1298.2842 1303.5341 1310.9550 1338.8293 1346.7557 1359.1588 1362.5766 1371.1016 1382.8734 1387.6163 1388.0213 1401.0741 1401.7706 1405.1591 1409.8821 1425.2083 1428.5806 1448.1170 1453.0110 1455.0364 1458.5007 1469.6182 1483.0116 1488.4794 1497.1792 1513.8425 1542.7514 1546.2955 1548.0296 1563.4475 1566.1094 1582.3148 1584.5531 1603.6016 1603.8669 1609.0591 1614.4344 3125.6552 3125.7136 3127.4016 3127.4761 3129.8949 3129.9255 3145.4691 3145.8197 3147.5313 3148.4871 3149.0677 3150.0549 3162.5882 3162.8246 3169.0983 3169.4576 3176.0090 3176.3878 3177.5105 3177.9177
redmass: 4.9274 6.0001 5.6032 5.2505 4.6292 4.4743 5.2194 4.4290 4.5537 5.4305 4.3575 4.8418 5.7332 5.0155 5.1395 4.8157 4.4275 6.3498 6.1178 5.9721 5.8251 5.7963 7.9184 5.3260 4.6125 5.3260 4.1323 5.2480 3.7484 3.8422 4.4769 4.8557 4.0479 4.1073 7.9292 7.2580 4.1976 7.1424 4.3418 6.9113 5.9988 4.3580 5.4408 4.9076 7.8608 6.5931 6.4568 3.8765 2.9909 6.7477 4.2886 7.5709 5.5373 4.7498 4.9450 3.8609 2.0172 3.4200 1.5285 1.5152 1.2680 2.0789 2.9640 4.5498 2.4370 6.2418 2.7150 2.3415 6.3106 1.4001 5.0788 1.5085 1.3594 5.8127 1.3548 1.4704 1.4166 1.3464 2.0039 1.3437 2.2379 1.3645 1.3422 1.3541 1.4690 1.5660 3.3858 3.3299 2.5153 3.7628 3.0674 2.6367 2.6119 1.9049 1.8320 1.9491 2.0837 1.5079 1.5916 1.1893 1.1067 1.2952 1.3698 1.2262 1.5504 1.7026 1.8848 1.8768 2.1981 1.5141 3.1024 1.7287 3.0403 4.7810 2.5761 5.6325 4.8144 7.2865 1.6973 7.3136 3.4435 4.9539 8.2693 5.3243 6.9887 2.1687 2.0756 2.7330 3.0842 2.7396 2.6131 6.2075 2.5595 4.9047 4.8645 4.8596 4.3028 6.4903 6.7023 6.4280 4.9481 4.9592 6.1998 6.6520 6.5065 6.6107 5.6984 6.0565 1.0866 1.0867 1.0862 1.0863 1.0855 1.0855 1.0906 1.0900 1.0950 1.0944 1.0942 1.0943 1.0945 1.0945 1.0982 1.0983 1.0941 1.0941 1.0953 1.0953
irintensity: 0.0000 0.2080 1.2033 0.0114 0.0161 0.0000 0.8622 3.8418 0.0000 0.2664 0.8149 0.4762 8.3081 0.1975 0.0000 0.0000 0.9299 0.3786 1.6301 0.1138 2.1531 0.0000 0.4037 0.0000 0.0764 4.0099 0.0027 0.8013 4.5839 1.2105 0.0522 10.0714 0.0077 0.0000 0.0000 0.4834 3.3136 3.0913 15.7589 0.0000 3.4166 0.0000 4.3790 8.4749 1.3732 1.1187 4.5212 0.0000 1.1576 0.4956 6.6514 0.0812 0.0000 3.1772 4.5287 0.0000 165.1819 61.1902 3.5659 0.0000 18.1561 0.4347 0.0184 21.4963 0.1594 0.0000 8.1199 102.8526 0.1292 0.0000 16.3249 4.7796 6.9729 0.0000 0.0000 2.7511 3.9990 0.1611 0.4366 0.0000 2.2394 2.4774 3.9745 0.0001 0.4695 5.2426 3.2366 1.4956 6.3279 0.0000 1.0228 16.3474 0.0000 6.5907 1.1692 6.8067 17.8768 0.0000 4.1099 0.1186 0.1162 0.4856 0.0000 0.4904 0.0000 1.3093 6.5660 0.0000 11.1181 9.2846 0.8157 0.0000 0.0018 0.1863 41.6084 5.7140 0.0000 3.7194 9.4697 0.0007 5.2831 0.0000 1.8699 12.9825 2.7462 4.9570 0.3407 0.0000 6.1234 0.0000 0.6269 1.1860 13.3469 3.0727 0.0000 2.2661 16.6007 0.0042 0.0000 0.2368 25.8230 6.4534 8.8369 0.0027 6.6778 0.0000 0.0000 25.7669 0.0019 7.0401 1.5528 0.1006 12.4168 0.1714 3.9005 9.8784 0.0003 57.1737 174.2786 4.4339 0.0000 0.0383 2.4275 20.6404 0.0011 14.2391 57.6970 1.5245
temp: 298.150 k
press: 1.00000 atm
elementType: 6 6 6 6 6 6 6 6 6 6 6 6 6 6 6 6 6 6 6 6 6 6 6 6 6 6 6 6 6 6 6 6 6 6 6 6 6 6 1 1 1 1 1 1 1 1 1 1 1 1 1 1 1 1 1 1 1 1
symmnumber: 1
zpe: 1170748.2 jmol-1
zpe.correction: 0.445914 hartree
zpe.thermalcorrener: 0.470695 hartree
zpe.thermalcorrenthalpy: 0.471639 hartree
zpe.thermalcorrgfe: 0.394046 hartree
zpe.sumelectzpe: -1457.697345 hartree
zpe.sumelectthermal: -1457.672564 hartree
zpe.sumelectthermalent: -1457.671620 hartree
zpe.sumelectthermalfe: -1457.749214 hartree
dipole: 0.0000 0.0000 -0.0808
dipole: 0.0808
quadrupole: -185.6947 -187.9772 -221.3249
quadrupole: 0.0001 0.0006 -0.0004
quadrupole: 12.6376 10.3551 -22.9927 0.0001 0.0006 -0.0004
hfenergy: -1458.1432593 hartree
pointgroup: C01 [X(C38H20)]
dipole: 0.0000003 -0.0000093 0.0317883 debye
polarizability: 947.04856|-0.0102037|586.4488216|0.0144529|0.0027585|232.1956159 unknown
InChI: InChI=1S/C38H20/c1-2-14-24-23(13-1)33-27-17-5-9-21-10-7-19-29(31(21)27)35-25-15-3-4-16-26(25)36-30-20-8-12-22-11-6-18-28(32(22)30)34(24)38(36)37(33)35/h1-20H
charge 0 multiplicity 1
58 atoms
C  -0.729416 0.000029 -0.149746
C  0.729418 -0.000001 -0.149713
C  -1.442317 -1.246887 -0.14202
C  1.442256 -1.246954 -0.141931
C  -1.442252 1.246982 -0.14197
C  1.442321 1.246913 -0.141936
C  -0.729009 -2.399616 -0.649511
C  0.728925 -2.399653 -0.649449
C  -0.728899 2.399685 -0.649455
C  0.729035 2.399646 -0.649455
C  -2.84237 -1.259164 0.28934
C  2.842283 -1.259297 0.289496
C  -2.842295 1.259317 0.289412
C  2.842354 1.259183 0.289492
C  -3.524061 0.000091 0.501226
C  3.524038 -0.000077 0.501375
C  -4.890103 0.000121 0.983476
C  4.890059 -0.000121 0.983684
C  -1.408344 -3.503533 -1.272379
C  1.408265 -3.503617 -1.272229
C  -1.408204 3.503648 -1.272276
C  1.408404 3.50355 -1.272309
C  -3.517765 -2.457142 0.649481
C  3.517587 -2.457311 0.649687
C  -3.517607 2.457317 0.649635
C  3.517735 2.457152 0.649691
C  -5.55299 -1.242586 1.241348
C  5.552855 -1.242863 1.241626
C  -5.552907 1.242855 1.241435
C  5.552933 1.242579 1.241622
C  -4.861188 -2.449641 1.098611
C  4.860988 -2.44988 1.098887
C  -4.861027 2.449875 1.098777
C  4.861137 2.449638 1.098884
C  -0.713669 -4.571336 -1.840687
C  0.713589 -4.571383 -1.840605
C  -0.713497 4.571406 -1.84063
C  0.713761 4.571353 -1.840655
H  -2.494646 -3.460228 -1.381797
H  2.494583 -3.460377 -1.381518
H  -2.494515 3.460415 -1.381627
H  2.494709 3.460228 -1.381687
H  -2.976148 -3.405242 0.639855
H  2.975913 -3.405379 0.640038
H  -2.975927 3.405381 0.640062
H  2.976122 3.405254 0.640064
H  -6.590818 -1.228016 1.593473
H  6.590667 -1.228346 1.593799
H  -6.590735 1.228328 1.593562
H  6.590743 1.228001 1.593797
H  -5.346162 -3.397423 1.355995
H  5.345893 -3.397686 1.356315
H  -5.345936 3.397671 1.35623
H  5.346101 3.397413 1.356312
H  -1.26275 -5.376775 -2.340371
H  1.262676 -5.376861 -2.340221
H  -1.26256 5.376881 -2.340275
H  1.262865 5.37678 -2.340332
