program: Gaussian 09
title: 000135980
version: EM64L-G09RevD.01
frameworkgroup: C1[X(C8H14)]
method: RPBEPBE
basis: SDD
operation: Freq
keyword: #p
keyword: freq=noraman
keyword: PBEPBE/SDD
title: #p freq=noraman PBEPBE/SDD
converged: YES YES NO NO
title: Mulliken charges:
elementType: C C C C C C C C H H H H H H H H H H H H H H
charge: 0.485003 -0.545347 -0.558598 -0.560359 -0.510831 -0.457521 -0.415279 -0.454419 0.222617 0.212525 0.216198 0.223281 0.216995 0.214285 0.224863 0.200241 0.227360 0.213727 0.210711 0.214197 0.209827 0.210524
chargesum: 0.00000
title: Mulliken charges with hydrogens summed into heavy atoms:
elementType: C C C C C C C C
charge: 0.485003 -0.110206 -0.119118 -0.129079 -0.085728 -0.016434 0.009629 -0.034068
polarizability: 9.05458021e+01 -1.37901706e-01 7.59863823e+01 -5.65805809e-01 -5.05902654e-01 7.41606695e+01
1716.lowfreq: -15.7723 -11.1435 -0.0003 -0.0003 -0.0002 8.1214 53.8896 105.1120 166.8911
frequency: 52.6205 105.0863 166.7860 244.1100 351.3538 366.5462 447.2157 583.0690 673.0387 718.2759 765.5426 790.5367 820.4857 851.5698 880.3554 894.3549 904.7289 943.8117 949.5199 982.8526 991.1686 1003.8441 1041.6153 1056.5725 1114.4806 1164.7701 1165.9763 1184.3968 1193.7144 1209.0780 1222.1679 1228.5763 1241.2157 1255.2088 1267.4213 1276.3194 1295.8978 1303.6204 1318.0579 1448.4554 1457.0033 1461.0696 1467.1392 1470.7260 1475.9477 1489.3246 2970.3621 2979.6868 2991.2618 2992.8738 2997.3947 3006.1855 3019.3407 3033.3711 3042.3310 3052.1062 3059.0448 3064.1756 3073.1153 3093.7563
redmass: 1.8204 1.9662 2.1387 2.0678 2.0059 1.9847 3.5447 2.0542 1.9750 1.9723 1.3094 1.2440 1.6616 2.0826 2.4709 1.9994 2.2502 2.4648 2.4604 1.8395 1.3659 1.3982 2.1242 1.5536 1.8097 1.9126 1.3511 1.4418 1.4992 1.5787 1.2424 1.3321 1.4139 1.5425 1.3567 1.6009 1.3033 1.5616 1.7646 1.0856 1.0864 1.0809 1.0894 1.0837 1.1187 1.0979 1.0624 1.0611 1.0611 1.0582 1.0581 1.0653 1.0634 1.1005 1.0992 1.1021 1.1060 1.1067 1.1048 1.1070
irintensity: 0.0080 0.0135 0.0254 0.0195 0.2323 0.2937 0.0821 2.5889 3.8224 1.1511 2.1884 0.9493 2.7252 1.1140 0.1801 3.6707 3.7308 4.0707 2.6298 2.0134 1.0643 2.7514 0.5954 0.6579 0.7363 2.4149 2.5716 0.4181 0.1638 1.4967 0.3869 0.7291 1.8699 5.7868 0.1664 3.6489 1.1082 0.8155 3.3319 10.0139 4.8184 4.7908 1.6443 10.7392 5.7253 4.4916 37.9159 27.1973 23.0619 91.9427 18.5473 66.5556 42.3224 15.5452 24.0596 17.7940 29.9698 7.8885 102.9490 82.5952
temp: 298.150 k
press: 1.00000 atm
elementType: 6 6 6 6 6 6 6 6 1 1 1 1 1 1 1 1 1 1 1 1 1 1
symmnumber: 1
zpe: 524386.8 jmol-1
zpe.correction: 0.199728 hartree
zpe.thermalcorrener: 0.207601 hartree
zpe.thermalcorrenthalpy: 0.208545 hartree
zpe.thermalcorrgfe: 0.167168 hartree
zpe.sumelectzpe: -312.575610 hartree
zpe.sumelectthermal: -312.567738 hartree
zpe.sumelectthermalent: -312.566794 hartree
zpe.sumelectthermalfe: -312.608170 hartree
dipole: -0.1156 0.0345 -0.0386
dipole: 0.1267
quadrupole: -51.8323 -50.6205 -50.7023
quadrupole: 0.1377 0.4091 0.3078
quadrupole: -0.7806 0.4312 0.3494 0.1377 0.4091 0.3078
hfenergy: -312.7753386 hartree
pointgroup: C01 [X(C8H14)]
dipole: -0.045511 -0.012699 0.0158494 debye
dipolederiv: 0.1016305 0.0610659 -0.000363 0.019513 0.1170954 0.0024078 -0.0711106 0.0005638 0.0581299 -0.0513612 -0.0571563 0.0158152 -0.0546797 0.1224402 0.0098661 0.0565002 -0.024327 0.0096572 -0.104632 -0.0318334 0.0345938 -0.0057581 0.0979616 0.0519548 -0.0146137 0.0795755 0.0941959 -0.042011 -0.0207544 -0.0122779 -0.0431506 0.0214783 0.0175403 0.0258792 -0.0115673 0.1281247 0.0113843 0.0141591 -0.0580711 0.0090099 0.0209178 -0.0519023 -0.0246264 -0.008186 0.1067169 0.0992138 -0.0716815 -0.0520338 -0.022562 0.1124907 0.0368041 -0.0407601 0.0511519 -0.009271 0.0477199 0.0218103 -0.0271184 0.0102025 -0.0060716 0.0139869 -0.0519082 0.0139226 0.1434272 0.0376355 -0.002635 -0.081998 -0.0028136 0.0430259 0.0020411 -0.0309345 -0.034285 0.1210969 0.0319031 0.0556772 -0.0715542 0.0441457 -0.0742307 0.1469308 -0.0468184 0.0931933 -0.0488591 0.0406022 0.005529 -0.0023477 0.0197663 -0.0900324 -0.1506841 0.0053852 -0.0955265 -0.0388983 0.0323552 0.041426 -0.0050851 0.0728963 -0.1692951 0.0623106 0.0009508 0.0101478 0.0500896 0.048781 -0.0046284 0.0047491 -0.0289336 0.0351263 -0.1039022 -0.0409498 -0.0491726 -0.1803244 0.0131497 0.0039294 0.0007302 -0.011972 0.0024644 0.0798438 0.0074386 0.1408889 -0.1240709 0.0220163 0.0699511 0.0402204 0.0520261 -0.0828961 -0.0887547 0.0265074 -0.140306 -0.0256443 -0.0055312 -0.1293087 -0.0053173 -0.103431 -0.1328073 -0.000012 0.00206 0.036059 0.0661441 0.006871 0.0191523 0.0455229 0.0192484 0.0680038 0.0397871 0.0452904 -0.0121485 -0.1936952 -0.1840849 0.055182 0.0698226 0.114224 0.040827 -0.0323736 0.0855045 -0.0191838 0.0427301 0.0477632 -0.0347659 -0.0056405 -0.0951884 -0.1565772 -0.0310414 -0.0205659 -0.0435702 0.0515081 -0.0952654 -0.051071 0.0885918 -0.0329543 0.0302776 0.0380033 0.1495042 0.0616758 -0.0360228 0.0006099 -0.0274273 -0.0729736 -0.0440627 0.0227403 -0.0624124 -0.1364154 -0.0829367 -0.1138744 0.0692959 -0.0479594 0.0476282 -0.0271545 0.0082769 0.0544761 0.0004952 0.0938737 -0.1529494 -0.1280457 0.1313388 0.0471064 0.1116283 -0.0312157 -0.03487 0.0731874 -0.0598424 0.0517895 unknown
polarizability: 90.5262217|0.3579119|75.8907607|0.7299137|-0.6466997|74.2758715 unknown
InChI: InChI=1S/C8H14/c1-2-5-8(4-1)6-3-7-8/h1-7H2
charge 0 multiplicity 1
22 atoms
C  0.275037 -0.15281 0.170328
C  1.130577 0.127816 -1.128008
C  1.618755 -0.387033 0.948829
C  -0.780032 -1.288015 0.119783
C  -0.559812 1.071956 0.622488
C  2.403801 0.291796 -0.227805
C  -2.152696 -0.605466 -0.207755
C  -1.870249 0.931475 -0.190882
H  0.833001 0.996997 -1.74142
H  1.195387 -0.760906 -1.782579
H  1.860516 -1.461819 1.042813
H  1.697557 0.081754 1.945676
H  -0.825146 -1.785854 1.108542
H  -0.506295 -2.064862 -0.617427
H  -0.042696 2.034998 0.454209
H  -0.772373 0.991496 1.708628
H  3.32368 -0.210772 -0.568808
H  2.63781 1.350237 -0.018465
H  -2.909298 -0.872221 0.552865
H  -2.552699 -0.928885 -1.185507
H  -1.708197 1.29894 -1.22253
H  -2.706426 1.514178 0.235825
