program: Gaussian 09
title: 000135937
version: EM64L-G09RevD.01
frameworkgroup: C1[X(C12H22ClNO2)]
method: RPBEPBE
basis: SDD
operation: Freq
keyword: #p
keyword: freq=noraman
keyword: PBEPBE/SDD
title: #p freq=noraman PBEPBE/SDD
converged: YES YES NO NO
title: Mulliken charges:
elementType: Cl O O N C C C C C C C C C C C C H H H H H H H H H H H H H H H H H H H H H H
charge: -0.075794 -0.263527 -0.247065 -0.142273 0.024272 -0.446771 -0.420529 -0.410429 -0.407817 -0.388561 -0.407673 -0.396345 -0.271945 -0.582592 0.293589 -0.749096 0.181731 0.204829 0.209596 0.204808 0.202174 0.203286 0.192531 0.191673 0.203165 0.195073 0.200754 0.220815 0.224705 0.238940 0.256828 0.255006 0.235052 0.269623 0.262381 0.247180 0.246336 0.246068
chargesum: 0.00000
title: Mulliken charges with hydrogens summed into heavy atoms:
elementType: Cl O O N C C C C C C C C C C C C
charge: -0.075794 -0.263527 -0.247065 -0.142273 0.206003 -0.032346 -0.013547 -0.014612 -0.012979 0.007267 0.037847 0.099423 0.218113 -0.050587 0.293589 -0.009512
polarizability: 1.74478520e+02 -6.09107541e+00 1.65485748e+02 -3.15737054e+00 1.68384815e+00 1.21140500e+02
1716.lowfreq: -55.7940 -21.3679 -14.5593 -0.0017 -0.0015 -0.0011 5.5230 17.2248 26.1948
frequency: -55.7783 10.0694 23.0138 32.4002 46.6642 48.4589 86.0966 111.7102 136.5584 152.1207 191.7247 199.2142 214.5650 226.6620 245.9702 275.2055 313.3615 342.7350 366.3032 414.4065 430.7691 442.9888 480.0742 519.7870 556.0260 564.8740 610.9875 670.1992 762.6942 767.2867 781.5752 786.0364 819.8384 845.1295 867.5541 889.7440 894.3542 924.2792 932.0439 978.4628 999.0721 1005.9624 1010.6163 1040.8635 1046.1195 1051.1961 1060.5193 1071.7050 1084.1247 1099.9160 1110.7615 1142.7383 1154.9922 1174.0960 1202.9557 1223.6075 1234.4402 1249.2100 1249.8085 1255.5579 1262.7454 1286.6150 1303.6745 1313.1864 1318.6366 1330.7313 1337.1172 1339.9213 1342.3076 1344.6521 1351.3635 1367.0360 1378.9575 1385.3117 1449.7324 1452.9572 1454.5281 1459.2064 1461.9154 1463.7792 1467.1038 1471.1774 1474.5568 1484.8900 1490.5308 1651.5103 2822.0386 2966.8725 2967.5729 2971.7201 2972.0623 2973.2169 2976.9392 3007.6616 3015.6854 3021.1862 3028.3322 3030.5843 3032.0926 3037.3746 3039.5382 3048.3338 3050.3443 3077.4029 3093.3268 3095.9366 3133.3833 3143.1612
redmass: 1.0332 4.3719 4.0969 4.9910 6.4115 5.1261 3.2562 3.0465 2.9891 3.2754 2.5287 5.7627 2.9507 2.3533 2.7302 3.6943 2.3031 3.1150 2.6168 3.1152 3.0280 2.4878 1.6934 4.4358 2.2613 2.9769 5.0622 5.7967 1.8570 1.2501 1.2299 1.4475 4.6804 2.8209 1.9841 1.4614 2.1260 2.0877 5.3228 2.2248 2.0994 1.6240 4.7655 1.6716 1.7440 1.4133 1.8966 1.9530 1.8566 1.7718 2.2710 2.2680 1.5425 1.3063 3.5406 1.7926 1.4990 1.1983 1.3985 1.2859 1.2088 1.1609 1.2006 1.2806 1.3611 1.4322 1.4737 1.4494 1.4584 1.4105 1.2270 1.4134 1.2599 1.4024 1.0923 1.0627 1.0475 1.0828 1.0852 1.0871 1.0812 1.0816 1.0873 1.0887 1.0782 9.3545 1.0805 1.0636 1.0640 1.0621 1.0604 1.0592 1.0617 1.0367 1.0644 1.0603 1.0980 1.0972 1.0956 1.1002 1.1022 1.1004 1.0589 1.1006 1.1089 1.0974 1.1116 1.1010
irintensity: 1.0181 0.4784 0.4776 1.2917 1.3923 0.4801 0.4259 0.3812 2.5218 0.6643 7.1846 2.6589 4.0987 2.8526 0.7861 5.3970 10.7555 6.6311 15.5795 6.9799 0.4990 4.0320 0.5498 5.8110 3.3233 2.8129 5.0409 91.1116 6.1253 10.9170 4.7598 0.3768 9.8082 6.6944 4.4208 8.1557 1.4663 0.1747 61.8223 10.6208 137.9918 2.8188 0.9191 5.1759 18.0073 6.9634 17.1900 20.3949 5.0733 26.9437 0.2214 10.7063 16.3229 5.1003 403.3749 16.8679 8.3798 11.8873 0.5576 7.6815 2.4237 4.7194 1.6705 1.0824 0.2351 5.2979 13.7884 0.8207 0.0492 3.5076 1.7963 15.5858 41.8068 21.7867 9.2626 25.4724 17.7913 14.5901 11.2670 6.2144 13.8446 22.6127 3.3445 3.6711 12.2427 198.5421 68.7518 30.1269 45.8862 36.0363 24.2396 25.2588 34.1673 2.7408 12.5526 16.4663 20.9972 95.8939 60.8125 4.2536 8.8822 91.8356 49.1363 13.9608 28.3991 10.7410 25.0139 11.4816
temp: 298.150 k
press: 1.00000 atm
elementType: 17 8 8 7 6 6 6 6 6 6 6 6 6 6 6 6 1 1 1 1 1 1 1 1 1 1 1 1 1 1 1 1 1 1 1 1 1 1
symmnumber: 1
zpe: 857597.6 jmol-1
zpe.correction: 0.326642 hartree
zpe.thermalcorrener: 0.344294 hartree
zpe.thermalcorrenthalpy: 0.345238 hartree
zpe.thermalcorrgfe: 0.276919 hartree
zpe.sumelectzpe: -1134.429131 hartree
zpe.sumelectthermal: -1134.411479 hartree
zpe.sumelectthermalent: -1134.410534 hartree
zpe.sumelectthermalfe: -1134.478853 hartree
dipole: -0.5069 -1.9834 -2.6770
dipole: 3.3700
quadrupole: -105.9815 -115.2845 -108.2448
quadrupole: 11.9415 -10.0856 1.3357
quadrupole: 3.8554 -5.4476 1.5921 11.9415 -10.0856 1.3357
hfenergy: -1134.7557722 hartree
pointgroup: C01 [X(C12H22Cl1N1O2)]
dipole: 0.4975712 0.742163 -0.9795641 debye
polarizability: 168.7977961|-7.6987255|171.1796174|2.2621052|1.9170558|121.1273549 unknown
InChI: InChI=1S/C12H22ClNO2/c1-11(15)16-10-9-14(8-7-13)12-5-3-2-4-6-12/h12H,2-10H2,1H3
charge 0 multiplicity 1
38 atoms
Cl 0.728008 -4.86739 -0.429514
O  -2.95763 0.848689 -0.425121
O  -3.856802 1.838228 1.483069
N  0.415353 -0.719617 0.085431
C  1.679712 -0.006145 -0.27276
C  2.904572 -0.561207 0.498128
C  1.544327 1.512911 0.022822
C  4.199244 0.207696 0.136252
C  2.828888 2.290746 -0.347628
C  4.059606 1.724558 0.39538
C  -0.811282 -0.26419 -0.610068
C  0.45556 -2.16721 0.3690
C  -1.740549 0.481598 0.360208
C  0.772949 -3.021503 -0.878265
C  -3.956527 1.53997 0.272021
C  -5.119965 1.855356 -0.643985
H  1.894767 -0.11084 -1.369304
H  3.057237 -1.635682 0.28232
H  2.706716 -0.470497 1.585611
H  1.328452 1.631798 1.103986
H  0.687027 1.940207 -0.531034
H  5.045955 -0.206875 0.716322
H  4.435525 0.04145 -0.935438
H  2.998883 2.223957 -1.442444
H  2.69401 3.363766 -0.11172
H  3.942924 1.901316 1.484347
H  4.979223 2.253435 0.079158
H  -1.370888 -1.12236 -1.031986
H  -0.566304 0.39432 -1.465998
H  -0.527498 -2.475312 0.770162
H  1.19435 -2.385057 1.15778
H  -1.276051 1.398473 0.761137
H  -2.036932 -0.156115 1.212205
H  1.786393 -2.845072 -1.269147
H  0.026101 -2.900044 -1.678056
H  -5.508252 0.929511 -1.101846
H  -4.787205 2.513172 -1.465885
H  -5.916197 2.352957 -0.072241
