program: Gaussian 09
title: 000011702
version: EM64L-G09RevD.01
frameworkgroup: C1[X(C7H16O)]
method: RPBEPBE
basis: SDD
operation: Freq
keyword: #pfreq=noraman
keyword: PBEPBE/SDD
title: #p freq=noraman PBEPBE/SDD
converged: YES YES NO NO
title: Mulliken charges:
elementType: O C C C C C C C H H H H H H H H H H H H H H H H
charge: -0.479070 0.389423 -0.486673 -0.398464 -0.408554 -0.716470 -0.728250 -0.730615 0.238032 0.193894 0.192543 0.214175 0.196435 0.214720 0.216572 0.220430 0.227246 0.208438 0.208718 0.251597 0.221925 0.225843 0.205626 0.322478
chargesum: 0.00000
title: Mulliken charges with hydrogens summed into heavy atoms:
elementType: O C C C C C C C
charge: -0.156591 0.389423 -0.054747 0.008254 0.002602 -0.052223 -0.059497 -0.077220
polarizability: 8.73606056e+01 1.69596290e-01 7.81806767e+01 1.26341746e+00 -1.16505433e-01 7.29045411e+01
1716.lowfreq: -17.5917 -13.2374 -0.0007 0.0002 0.0002 5.7891 56.6734 103.7842 118.8446
frequency: 56.3934 103.7551 118.5677 180.0049 203.5440 217.7540 232.2370 269.7695 273.8783 318.0308 331.1683 380.6349 411.1205 465.8774 532.5063 679.3545 748.2494 766.4152 789.0970 898.8474 913.4464 915.9318 1011.1443 1021.7112 1039.6433 1056.5683 1061.4184 1084.3156 1121.2087 1154.1926 1187.3379 1253.1763 1259.8706 1274.7544 1305.9857 1330.1266 1350.1724 1364.5614 1385.5193 1389.3664 1391.8688 1444.5230 1458.0664 1467.6393 1477.0588 1481.2439 1482.0277 1485.3481 1488.1034 1496.1327 2969.6928 2973.6112 2978.7762 2981.1119 2982.6770 2987.9025 3029.1568 3035.2651 3037.8097 3063.0520 3069.4210 3074.4792 3075.5550 3079.5772 3094.5993 3551.7211
redmass: 2.1343 2.3908 1.5028 2.8837 1.1761 1.0431 1.5149 1.1670 1.8086 2.3578 2.1260 3.3031 3.3566 2.5243 2.3413 2.9832 1.2283 1.4854 1.1960 2.0771 1.8735 1.6532 1.4627 1.7022 1.7863 2.6377 1.5699 2.3430 1.5152 2.2122 2.0132 1.3395 1.2849 1.2624 1.4368 1.4188 1.4741 1.8089 1.2122 1.2319 1.2119 1.0762 1.0670 1.0707 1.0482 1.0472 1.0428 1.0554 1.0452 1.0653 1.0493 1.0525 1.0557 1.0396 1.0402 1.0576 1.1001 1.0951 1.0988 1.0986 1.0990 1.0990 1.0990 1.1000 1.0999 1.0655
irintensity: 0.4538 0.2589 2.6882 0.5315 1.0306 0.0285 21.3792 85.2201 31.1026 3.7365 1.4960 6.3982 6.4299 6.1950 3.6431 1.7844 2.5453 3.8981 4.6375 74.7454 11.4382 27.0920 5.3806 0.1740 6.6264 2.1105 18.6558 3.1553 26.8733 9.4385 13.2546 1.5765 2.0312 6.3492 8.5589 0.7347 3.3239 8.7304 30.2542 8.3571 21.0182 0.2788 4.9482 33.0615 6.7028 9.2564 4.0738 12.1293 16.0829 3.5439 4.4570 73.6029 11.2903 26.0560 24.9267 44.9555 0.7058 18.0806 17.1935 45.6341 64.6799 102.3199 15.6010 39.4002 30.7352 4.3057
temp: 298.150 k
press: 1.00000 atm
elementType: 8 6 6 6 6 6 6 6 1 1 1 1 1 1 1 1 1 1 1 1 1 1 1 1
symmnumber: 1
zpe: 568908.5 jmol-1
zpe.correction: 0.216686 hartree
zpe.thermalcorrener: 0.227673 hartree
zpe.thermalcorrenthalpy: 0.228617 hartree
zpe.thermalcorrgfe: 0.181257 hartree
zpe.sumelectzpe: -350.870067 hartree
zpe.sumelectthermal: -350.859080 hartree
zpe.sumelectthermalent: -350.858136 hartree
zpe.sumelectthermalfe: -350.905495 hartree
dipole: 1.1945 1.4222 -0.2010
dipole: 1.8681
quadrupole: -51.7295 -55.4623 -50.8864
quadrupole: -1.5745 2.0021 1.1594
quadrupole: 0.9632 -2.7696 1.8064 -1.5745 2.0021 1.1594
hfenergy: -351.0867526 hartree
pointgroup: C01 [X(C7H16O1)]
dipole: 0.4863116 0.5442998 -0.086127 debye
dipolederiv: -0.3879022 0.1378839 0.1530768 0.1335133 -0.707381 0.191461 0.1811978 0.1667354 -0.6128636 0.3468072 -0.0647074 -0.0271942 -0.0585184 0.5023808 -0.1133069 -0.0529392 -0.0776428 0.434833 0.0738466 -0.0104303 0.0337041 0.014932 -0.0537224 0.008065 0.0281501 -0.0739671 -0.0085642 0.0007024 0.0215998 -0.0394578 -0.0088404 0.0858199 -0.0465927 0.0167296 -0.0200348 0.0604907 -0.0412245 -0.0157907 0.0574953 0.0213825 0.0623139 -0.029026 0.0045426 -0.0111342 0.0192252 0.0892975 0.0086854 -0.008353 0.0056582 -0.0487065 0.0705321 -0.0038852 0.0371226 0.0291042 -0.0861865 -0.0013842 0.0555467 0.0066592 0.0878695 0.0136588 0.0136659 0.0152176 0.0168238 -0.1188873 0.011087 -0.0307042 0.0015157 0.099331 -0.0109193 0.011055 -0.0135909 0.0323803 -0.0614286 0.0309344 0.1374405 0.0180456 0.0278461 0.0150314 0.1246654 0.0154479 -0.0122153 -0.1006069 -0.0142439 -0.1639711 -0.0070772 0.0119957 0.0273178 -0.1453912 0.0217578 -0.027335 0.0236248 -0.0186225 0.0386861 -0.0076241 -0.0007894 0.1447315 0.0391663 0.1176342 -0.0838759 0.0340853 0.0309858 0.0172309 0.0103387 -0.129162 -0.1169632 0.023578 -0.0868284 0.0391904 0.0272707 0.0089129 -0.0188476 0.0007332 -0.0234316 0.1504919 -0.029446 0.1342346 -0.0678499 0.0292395 -0.0263844 -0.0227271 -0.0041812 -0.1167474 -0.12774 -0.0168302 -0.0957851 0.018037 0.0927102 0.0073904 0.0031288 0.0081359 -0.1522522 -0.0923463 0.0041156 -0.1372889 0.0131475 -0.087082 -0.0285212 0.1205971 0.0082698 0.0966483 0.0036725 0.1165064 0.0336038 -0.0145992 -0.0756696 0.017776 -0.1164668 -0.0149591 0.0984275 -0.0029147 -0.1187186 0.0243936 -0.0127136 0.0790309 0.0223372 0.0242823 0.062684 -0.1655144 -0.0724084 0.0390055 -0.064883 0.0534509 -0.135303 -0.0566844 -0.1027154 -0.0700177 0.070945 -0.0478067 -0.1397181 -0.0569178 0.002592 0.119493 0.0162787 0.0038158 -0.0167943 0.0327041 0.087918 0.0558914 0.0911566 -0.0572323 0.0894317 -0.0189945 -0.023811 -0.0550309 -0.1290933 -0.0953093 -0.050385 -0.0892191 0.028159 -0.1118648 0.0407452 0.1037702 0.043741 0.0869987 -0.0264376 0.1441856 -0.0381788 -0.0004034 0.0972161 -0.0278261 0.0050057 0.0213349 -0.02877 0.125051 -0.0607402 0.1333628 -0.0754619 0.1033998 -0.071027 -0.1995323 -0.1139007 0.2922897 -0.0561596 -0.1844017 -0.0251961 0.2256803 unknown
polarizability: 87.3673869|-0.0912991|78.1746276|1.2323394|-0.2130886|72.9038088 unknown
InChI: InChI=1S/C7H16O/c1-4-7(8,5-2)6-3/h8H,4-6H2,1-3H3
charge 0 multiplicity 1
24 atoms
O  -0.051634 -1.384264 1.067467
C  0.005865 -0.290138 0.051488
C  -0.003206 1.066671 0.807412
C  -1.260459 -0.522164 -0.811464
C  1.271985 -0.483941 -0.834454
C  -0.027368 2.324016 -0.089768
C  -2.600824 -0.349326 -0.068447
C  2.624546 -0.408124 -0.092962
H  -0.880248 1.070608 1.481138
H  0.888299 1.111313 1.467345
H  -1.220555 0.149824 -1.691327
H  -1.193796 -1.556948 -1.199889
H  1.257916 0.266701 -1.649279
H  1.181635 -1.476412 -1.317479
H  -0.056914 3.240735 0.527018
H  0.868674 2.384956 -0.734031
H  -0.917148 2.334311 -0.745084
H  -2.782484 0.701275 0.224425
H  -3.442967 -0.66349 -0.712261
H  -2.612698 -0.970633 0.843368
H  2.804797 0.58888 0.349199
H  3.456613 -0.614841 -0.790175
H  2.689241 -1.162247 0.715218
H  0.688528 -1.250263 1.713142
