program: Gaussian 09
title: 000135923
version: EM64L-G09RevD.01
frameworkgroup: C1[X(C10H5Cl3N2O3)]
method: RPBEPBE
basis: SDD
operation: Freq
keyword: #p
keyword: freq=noraman
keyword: PBEPBE/SDD
title: #p freq=noraman PBEPBE/SDD
converged: YES YES NO NO
title: Mulliken charges:
elementType: Cl Cl Cl O O O N N C C C C C C C C C C H H H H H
charge: 0.032199 0.033826 -0.012763 -0.113237 -0.391302 -0.357141 0.036289 -0.100722 0.024456 0.296080 0.251784 0.099877 -0.263864 -0.353025 -0.209351 -0.246523 -0.146986 -0.194928 0.308439 0.294006 0.288303 0.374908 0.349676
chargesum: 0.00000
title: Mulliken charges with hydrogens summed into heavy atoms:
elementType: Cl Cl Cl O O O N N C C C C C C C C C C
charge: 0.032199 0.033826 -0.012763 -0.113237 -0.016393 -0.007465 0.036289 -0.100722 0.024456 0.296080 0.251784 0.099877 0.044574 -0.059019 -0.209351 -0.246523 -0.146986 0.093375
polarizability: 3.56565414e+02 9.32541247e+00 2.18967416e+02 6.42568916e+00 -5.35032433e+00 7.84499629e+01
1716.lowfreq: -2.9373 -0.0010 0.0017 0.0021 4.0902 4.9987 32.2301 37.8745 64.1133
frequency: 32.2296 37.8733 64.1125 91.9216 95.7122 126.5462 135.4979 152.0228 171.1342 192.9885 213.3088 256.0665 262.6424 309.1222 314.9769 343.0431 358.5653 363.0144 382.5392 392.8425 435.6993 452.7371 500.1798 513.8823 545.5020 552.6700 589.1594 621.5912 622.7415 694.1690 719.4320 734.7095 794.3285 797.9983 806.2052 818.8769 856.0539 874.9093 891.8377 913.6785 979.4483 1069.5510 1076.0998 1107.2089 1120.1063 1209.1634 1272.3824 1285.9207 1296.9134 1304.1577 1335.8286 1349.3001 1369.7083 1498.3857 1523.9890 1536.2636 1562.9130 1593.2231 3173.6141 3175.5111 3244.8094 3307.7899 3500.1991
redmass: 16.0015 13.7519 10.4392 11.9979 8.5764 8.0264 9.7860 7.8764 13.8415 11.8787 6.7992 8.4051 10.1330 12.8894 7.1826 4.9028 5.1672 3.9763 1.4571 7.9518 1.9955 5.8511 7.3276 3.8896 4.8591 4.3588 8.4568 6.2669 4.9739 9.0266 10.2013 7.9659 5.8252 7.1209 1.6855 6.4726 8.9571 1.3887 9.3205 1.3682 5.0828 2.1166 2.7055 4.4147 3.3819 3.6498 2.8513 2.3995 1.6458 1.7050 1.6125 3.4245 3.3588 9.4157 8.6337 10.1647 10.2775 7.0784 1.0932 1.0938 1.0992 1.0659 1.0676
irintensity: 0.0728 1.0629 1.2888 1.8319 0.8410 0.3780 0.1402 2.4422 1.2895 1.1479 0.3672 9.5614 1.2296 1.6410 5.1391 2.7545 15.6608 21.8874 47.6886 8.2808 102.9283 35.9556 5.2164 101.2308 129.6948 5.1414 54.4041 1.0554 3.5849 13.4736 65.6039 8.2969 102.5220 26.6704 16.6792 24.2512 133.7345 22.1441 14.0979 14.0258 73.3616 25.6428 91.9931 7.4544 38.2589 319.1006 31.6030 125.7142 30.7197 34.0613 13.5014 104.7127 54.0269 28.4785 148.0299 108.5944 35.7361 107.7280 1.9270 5.3682 1.9658 0.9490 31.3299
temp: 298.150 k
press: 1.00000 atm
elementType: 17 17 17 8 8 8 7 7 6 6 6 6 6 6 6 6 6 6 1 1 1 1 1
symmnumber: 1
zpe: 346468.5 jmol-1
zpe.correction: 0.131963 hartree
zpe.thermalcorrener: 0.148940 hartree
zpe.thermalcorrenthalpy: 0.149884 hartree
zpe.thermalcorrgfe: 0.085685 hartree
zpe.sumelectzpe: -2097.963365 hartree
zpe.sumelectthermal: -2097.946388 hartree
zpe.sumelectthermalent: -2097.945444 hartree
zpe.sumelectthermalfe: -2098.009643 hartree
dipole: -0.1023 5.1321 0.2871
dipole: 5.1412
quadrupole: -107.3538 -132.2302 -124.4904
quadrupole: -2.8586 -4.1214 8.8442
quadrupole: 14.0043 -10.8721 -3.1323 -2.8586 -4.1214 8.8442
hfenergy: -2098.0953279 hartree
pointgroup: C01 [X(C10H5Cl3N2O3)]
dipole: 0.1328101 -2.0174938 -0.0583032 debye
dipolederiv: -0.8197696 -0.378662 0.1519498 -0.7954795 -0.4936489 0.1633504 0.2240378 0.0954781 -0.0616801 -0.484392 0.3870644 0.1191378 0.5114535 -0.5068081 -0.1567972 0.1517643 -0.1528121 -0.0557937 -0.4453289 -0.2268574 -0.0674873 -0.659063 -0.5966842 -0.1686099 -0.2237489 -0.1896163 -0.0901941 -0.1217953 -0.1033103 -0.0800611 0.3956504 -0.551041 -0.2045287 0.1070046 -0.186409 -0.3607878 -0.4554873 0.2613673 0.0701937 0.1124573 -0.2474876 0.2087963 0.1443239 0.5661346 -0.5744668 -0.5594625 0.4136964 0.316193 0.2116293 -0.4384349 0.098198 -0.098316 0.4261843 -0.193342 -0.9969369 -0.0377318 0.1062778 -0.003329 -0.4865333 0.0597246 0.3167517 0.0267422 -0.2117192 0.7626124 -0.8001605 -0.2700999 0.0692879 -0.2375083 -0.0317595 0.0957525 -0.8642459 0.5080708 -0.3328552 0.0442007 -0.0176986 0.8472041 0.0914124 -0.1264676 -0.1246326 -0.0395292 0.065195 -0.1319504 0.1685477 0.1130979 0.8361346 -0.0005725 -0.0358367 0.2841303 -0.0034853 0.0251882 1.0941403 0.2185034 -0.1047551 -0.5025886 0.3778779 -0.0464256 -0.1845858 0.0021207 -0.0640936 0.3321311 0.2885183 0.1604689 -0.3667703 0.4176657 0.2405183 -0.077069 0.1678635 0.3188282 -0.7331359 -0.0672976 -0.0194097 -0.3716191 -0.259135 -0.049016 -0.2080624 -0.0403944 -0.0875506 -0.4508364 -0.2747299 0.0311922 -0.9155131 -0.4972846 0.1998434 -0.0029541 0.1902179 -0.1845749 1.1332203 0.4447796 -0.2467817 1.1337452 1.3194153 -0.2879419 -0.3531867 -0.1353342 0.1283948 0.8280474 -0.6219287 -0.2469318 -0.7306697 0.7773601 0.2324455 -0.2040125 0.2378627 -0.0163866 0.7745696 0.2478013 0.0952378 0.580693 1.0958301 0.3631427 0.2257891 0.3701362 0.0598496 0.1143301 -0.0604484 -0.0390218 -0.092007 -0.5275089 -0.130612 -0.0415441 -0.1512598 -0.0648519 0.0837696 0.0543306 0.0296314 -0.0386158 0.0368204 -0.0311999 0.0116218 -0.0178853 0.1319882 0.0606916 0.0488458 0.0275576 0.0382135 0.0653945 -0.0086235 0.0244278 -0.0081196 0.2057306 0.0125161 0.0112695 -0.0012122 -0.023254 0.1032881 -0.0198054 -0.0188805 -0.0128457 0.1603584 0.2282154 -0.0981303 -0.0163455 -0.0929339 0.2694142 -0.1070925 0.0111384 -0.1481536 0.2389101 0.1077067 0.0803319 -0.1111333 -0.1446257 0.2881686 -0.1613029 -0.0597496 -0.1326497 0.1229274 unknown
polarizability: 353.0742679|17.4898334|218.4661433|-25.5517114|15.0094743|82.4423814 unknown
InChI: InChI=1S/C10H5Cl3N2O3/c11-4-1-5(10(16)6(12)2-4)9-7(15(17)18)3-8(13)14-9/h1-3,17-18H
charge 0 multiplicity 1
23 atoms
Cl 3.98032 2.488216 -0.826977
Cl -3.866392 2.557503 0.711001
Cl -3.369899 -2.705808 -0.886425
O  -0.883444 2.305615 1.093784
O  1.115028 -2.483164 1.253918
O  2.903417 -3.000804 -0.248813
N  1.506925 1.506826 -0.204618
N  1.669774 -2.23686 -0.122074
C  0.871234 0.249793 -0.07256
C  -0.524904 0.115898 0.050934
C  1.902436 -0.83373 -0.232659
C  -1.367578 1.294707 0.508565
C  -1.179314 -1.11701 -0.30852
C  3.105644 -0.207525 -0.524708
C  2.776633 1.217383 -0.491202
C  -2.841214 1.132012 0.327901
C  -2.558273 -1.176764 -0.351244
C  -3.419891 -0.058359 -0.047012
H  -0.579654 -1.963256 -0.649409
H  4.071896 -0.6448 -0.76169
H  -4.505069 -0.167944 -0.124462
H  0.589918 -3.32341 1.138473
H  3.514306 -2.699017 0.495497
