program: Gaussian 09
title: 000011698
version: EM64L-G09RevD.01
frameworkgroup: C1[X(C6H14NO4P)]
method: RPBEPBE
basis: SDD
operation: Freq
keyword: #p
keyword: freq=noraman
keyword: PBEPBE/SDD
title: #p freq=noraman PBEPBE/SDD
converged: YES YES NO NO
title: Mulliken charges:
elementType: P O O O O N C C C C C C H H H H H H H H H H H H H H
charge: 1.392575 -0.247882 -0.493760 -0.533550 -0.591674 -0.565459 -0.316917 -0.305566 -0.288162 -0.291299 -0.483758 -0.483872 0.242442 0.237293 0.247812 0.226831 0.224756 0.187232 0.194557 0.221771 0.228484 0.239101 0.234942 0.258287 0.234490 0.231328
chargesum: 0.00000
title: Mulliken charges with hydrogens summed into heavy atoms:
elementType: P O O O O N C C C C C C
charge: 1.392575 -0.247882 -0.493760 -0.533550 -0.591674 -0.565459 0.162817 0.169077 0.123826 0.125029 0.218768 0.240233
polarizability: 1.17337015e+02 4.11815668e+00 1.04685988e+02 6.09514275e-02 2.78365462e-01 9.45332142e+01
1716.lowfreq: -13.1318 -0.0012 -0.0010 0.0004 0.7797 4.8031 33.8411 56.2618 61.0522
frequency: 32.9637 56.0868 60.9375 70.4492 86.4455 96.7166 136.9527 169.1085 195.1988 208.4158 243.6811 257.9342 288.0785 329.4174 369.0332 386.2873 417.3754 452.1085 458.0160 541.9373 603.8525 672.5526 681.2004 793.8439 840.2220 901.1628 933.4164 964.4503 969.5966 1017.4138 1036.9995 1052.1374 1066.9022 1074.2064 1110.9017 1115.2801 1117.4969 1126.7773 1136.9438 1151.4313 1195.3629 1247.2575 1274.8632 1308.9547 1331.4302 1345.2581 1362.3296 1369.4957 1419.1940 1426.4951 1443.0053 1450.3247 1451.1655 1454.5602 1459.1164 1461.3564 1473.5643 1478.0436 2947.1622 2951.9733 2962.0920 2963.5910 2977.3346 2986.8657 3060.4695 3077.1264 3082.0887 3084.2019 3085.2236 3089.9663 3122.0241 3123.9985
redmass: 3.3618 4.0219 1.0981 2.6711 1.1716 2.4870 4.9640 3.7152 4.0365 5.0889 2.5624 5.0246 3.9429 3.9189 5.7692 2.2753 4.2774 7.0150 2.8452 4.0054 3.1602 4.3577 8.5333 4.1656 1.6363 2.3865 3.5913 11.0411 9.4274 2.3396 4.5981 2.0284 3.1775 4.1903 1.2538 1.7098 1.4842 1.3056 1.3321 4.9851 1.0654 1.2897 1.2099 1.3849 1.2265 1.2325 1.3277 1.2505 1.1194 1.1173 1.0820 1.0929 1.0760 1.0587 1.0529 1.0881 1.0537 1.0524 1.0684 1.0689 1.0648 1.0642 1.0302 1.0292 1.0971 1.1036 1.0954 1.0946 1.0992 1.1054 1.1034 1.1042
irintensity: 0.6873 1.7541 0.1255 3.9691 0.7344 1.3259 3.6147 0.8835 24.0602 5.6513 11.4006 9.4637 11.9481 15.6725 5.5113 3.1656 11.3056 39.2743 1.6589 2.5715 46.4449 75.4996 113.8047 6.9386 0.6589 22.7568 222.4992 146.0481 138.9093 6.5961 59.1036 24.1744 95.8333 36.8822 0.2034 27.7178 18.3470 0.2982 0.7300 24.1585 0.2668 52.7284 4.7615 4.5309 0.7874 6.1458 0.9601 1.5085 2.6243 3.3766 3.6767 16.7097 5.3542 7.1280 12.4365 15.1382 8.9045 10.7143 57.9792 19.8694 9.1721 137.4339 48.6930 56.4854 16.2653 37.6417 37.3669 4.0433 34.3996 25.0113 16.6601 14.6017
temp: 298.150 k
press: 1.00000 atm
elementType: 15 8 8 8 8 7 6 6 6 6 6 6 1 1 1 1 1 1 1 1 1 1 1 1 1 1
symmnumber: 1
zpe: 548426.9 jmol-1
zpe.correction: 0.208885 hartree
zpe.thermalcorrener: 0.223545 hartree
zpe.thermalcorrenthalpy: 0.224489 hartree
zpe.thermalcorrgfe: 0.166086 hartree
zpe.sumelectzpe: -932.867443 hartree
zpe.sumelectthermal: -932.852783 hartree
zpe.sumelectthermalent: -932.851839 hartree
zpe.sumelectthermalfe: -932.910241 hartree
dipole: 0.2656 -0.4084 -3.7812
dipole: 3.8124
quadrupole: -85.4528 -72.1985 -84.2457
quadrupole: 7.1945 9.3312 -1.9036
quadrupole: -4.8205 8.4338 -3.6134 7.1945 9.3312 -1.9036
hfenergy: -933.0763278 hartree
pointgroup: C01[X(C6H14N1O4P1)]
dipole: 0.0213936 0.1163091 1.4952472 debye
dipolederiv: 2.3395791 0.0545049 -0.1230062 -0.1566256 1.8478908 -0.3590648 -0.1686629 0.0285831 1.561148 -0.5118236 0.0624649 -0.0554507 0.0529607 -0.7171849 -0.1295254 -0.0600578 -0.1334333 -0.501069 -0.6320746 -0.0243609 0.005476 -0.047473 -0.896775 0.4055895 0.0606132 0.4313883 -0.8934304 -1.142721 0.3929251 0.1550589 0.4527157 -0.8511344 -0.092173 0.2350127 -0.2135971 -0.6221142 -0.8129294 0.0078154 -0.0552413 0.0319084 -0.6155613 0.0455958 -0.0630278 -0.0041971 -0.7056438 -1.2008705 -0.0931113 0.0461064 -0.0491839 -0.7537754 -0.0011262 -0.0347382 -0.054585 -0.5859257 0.2609777 -0.1637852 -0.1893504 -0.2947823 0.1987284 0.0231838 -0.3578821 0.0125494 0.2603475 0.0893489 0.2261175 0.0098803 0.4538282 0.3950064 -0.0070593 -0.0362109 -0.0171292 0.1977916 0.2901765 0.177754 0.0635164 0.1134904 0.5594865 0.0570787 0.1091329 0.0184974 0.3686048 0.3657278 -0.2081692 -0.1060732 -0.1942442 0.4167266 0.0505144 -0.0190983 0.0985848 0.4184498 0.2702256 -0.0711981 0.0297062 -0.0051135 0.2468912 -0.064205 -0.0870706 -0.3397244 0.561116 0.7417634 -0.3200498 -0.1448781 -0.1913486 0.35881 0.0454925 0.059424 -0.0784793 0.1486437 -0.0396209 0.0448314 0.0723304 0.0110485 0.0297679 0.1102373 0.1126524 0.0250553 -0.1203748 0.0675318 -0.1010463 -0.045858 -0.0485241 -0.0463062 -0.0314001 -0.0050202 -0.0266651 0.080322 0.0727752 0.1058559 0.056049 0.0496492 0.0162702 -0.0441226 0.0411455 -0.0423254 0.0594855 -0.0079968 -0.1037504 0.0192529 -0.100276 -0.0368941 0.0436623 0.0498636 0.1334671 -0.1073794 -0.0728155 0.1011262 0.048633 0.0645194 -0.0222137 -0.0632152 0.0579006 -0.0896759 0.0401972 0.0365893 -0.1256607 0.0551793 -0.0493839 -0.0560027 0.0399564 0.0323688 0.1377419 -0.1460165 0.0132441 0.0489385 0.1129696 0.0106315 -0.0055704 0.1311635 0.0609531 0.0237042 -0.1553846 -0.0322558 -0.0945593 -0.0413503 -0.0739017 -0.1028672 -0.0711068 -0.0180741 -0.0391474 0.0782312 -0.1073868 0.0036612 -0.1058957 -0.0402037 0.0951043 -0.0346169 -0.0550747 0.0248607 0.004589 0.1093071 -0.020621 0.0022915 -0.0373937 -0.1348311 0.0527567 0.0033154 0.0517236 0.0454226 -0.0256305 0.048717 0.1019388 0.0879623 0.0598442 -0.0746615 0.0873042 0.0266632 -0.0660538 0.0427427 0.0315039 0.0200276 0.0089373 0.0998117 0.0217119 -0.0831221 0.0997326 -0.048951 0.0273062 0.0340474 -0.0002725 0.0560216 -0.0723097 -0.1082895 0.0240986 -0.120218 0.0523045 -0.1411699 -0.0139511 0.0689601 -0.1052189 -0.0129121 0.0536236 0.0542547 0.0466256 0.0756896 unknown
polarizability: 116.7612582|-4.8360305|105.1764364|1.2033153|0.2562089|94.6185231 unknown
InChI: InChI=1S/C6H14NO4P/c1-9-12(8,10-2)7-3-5-11-6-4-7/h3-6H2,1-2H3
charge 0 multiplicity 1
26 atoms
P  -1.299567 -0.095742 -0.593468
O  3.205986 0.142142 0.317481
O  -1.675514 -1.713646 -0.089775
O  -1.903764 0.979964 0.633363
O  -1.887907 0.168302 -2.046006
N  0.395555 0.02768 -0.230262
C  1.323715 -0.920347 -0.905701
C  1.030478 1.330553 0.099158
C  2.545612 -1.135076 0.004927
C  2.260189 1.055866 0.982565
C  -1.444233 -2.098727 1.320406
C  -3.22496 1.608653 0.393409
H  1.656011 -0.511761 -1.883304
H  0.806494 -1.880243 -1.084754
H  0.304737 1.959672 0.640389
H  1.34997 1.855887 -0.826341
H  3.311457 -1.746673 -0.500157
H  2.227274 -1.634867 0.945921
H  1.932048 0.618717 1.950269
H  2.828791 1.98271 1.165183
H  -0.420034 -1.834671 1.643913
H  -1.586113 -3.189971 1.341024
H  -2.179042 -1.605203 1.980749
H  -3.358193 1.846738 -0.676937
H  -3.22277 2.52775 0.998813
H  -4.031019 0.932793 0.729133
