program: Gaussian 09
title: 000135857
version: EM64L-G09RevD.01
frameworkgroup: C1[X(C12H16N2)]
method: RPBEPBE
basis: SDD
operation: Freq
keyword: #pfreq=noraman
keyword: PBEPBE/SDD
title: #p freq=noraman PBEPBE/SDD
converged: YES YES NO NO
title: Mulliken charges:
elementType: N N C C C C C C C C C C C C H H H H H H H H H H H H H H H H
charge: -0.456151 -0.062532 -0.023038 -0.401104 -0.534026 0.164793 -0.710407 -0.714616 0.292645 0.014715 -0.380196 -0.353661 -0.216145 -0.234941 0.205905 0.185322 0.230309 0.221311 0.258499 0.212693 0.215874 0.219275 0.208128 0.213763 0.217997 0.303120 0.229701 0.247244 0.221874 0.223649
chargesum: 0.00000
title: Mulliken charges with hydrogens summed into heavy atoms:
elementType: N N C C C C C C C C C C C C
charge: -0.153032 -0.062532 0.182867 0.014527 -0.054216 0.164793 -0.062565 -0.074728 0.292645 0.014715 -0.150494 -0.106416 0.005729 -0.011292
polarizability: 2.11601770e+02 1.41867754e+00 1.35122144e+02 -9.46663410e+00 1.83827143e+00 8.33276839e+01
1716.lowfreq: -15.3410 -7.7217 -0.0005 -0.0005 0.0001 8.2053 11.0662 26.5106 59.2580
frequency: 1.5995 25.8119 59.1839 98.7836 170.4097 184.4183 220.7062 239.6658 251.4589 254.6810 343.2699 355.7080 367.4197 435.8638 467.3537 481.9410 546.5362 581.2959 590.8773 612.9349 668.5055 719.2389 752.9494 755.6319 770.8171 795.9963 828.3384 856.2614 876.8099 909.7236 934.9392 942.5911 950.1088 962.0339 974.9822 975.5556 996.0193 1009.0805 1095.3184 1109.8493 1118.6009 1158.7976 1188.1792 1192.1752 1205.1968 1223.9713 1257.3555 1264.4476 1279.6614 1305.6608 1323.1693 1333.4272 1354.7595 1364.7903 1377.3720 1393.4180 1412.8525 1445.2399 1453.2552 1465.1306 1470.5645 1475.0371 1477.6720 1483.7783 1490.1980 1526.9883 1594.3894 1634.3771 2954.0117 2966.8473 2971.1306 2975.7836 2988.1279 3026.8307 3060.4200 3064.9071 3071.1587 3071.8924 3086.7888 3127.9895 3140.5417 3155.9910 3170.2892 3594.7939
redmass: 3.0305 3.7617 4.4438 2.0515 3.2547 4.2341 1.1162 1.0512 4.4894 2.6340 3.2767 2.1105 2.6714 3.0370 3.6486 3.2425 3.9595 2.6517 1.3611 6.7225 4.5532 4.3125 1.2862 1.3377 3.6598 3.3379 4.2902 1.5037 5.3213 1.2216 1.3832 1.4780 2.3747 2.6713 1.3048 2.0652 2.2226 2.1245 1.6375 1.6187 1.7903 1.1442 1.6481 1.8874 2.6099 1.4205 2.1163 1.6441 1.3214 1.8360 1.5195 1.4953 1.3741 2.4723 1.2387 1.2187 2.8916 3.6505 1.0874 1.0455 1.1909 2.3902 1.1057 1.0537 1.0543 5.2947 6.9353 7.4247 1.0737 1.0384 1.0584 1.0455 1.0664 1.0975 1.0999 1.0995 1.0988 1.0994 1.0957 1.0853 1.0904 1.0956 1.0992 1.0811
irintensity: 1.2987 0.4659 0.7544 0.0886 1.5273 1.8123 0.0904 0.1291 5.7321 2.1457 0.2208 0.2070 0.8951 8.6403 6.2639 3.6747 2.7509 15.5240 68.6361 0.6302 7.9964 1.8620 66.3034 47.4215 5.7866 1.8749 5.0755 0.1547 1.9707 2.5752 4.1709 0.0130 0.5214 0.9676 0.0831 1.8900 9.2381 4.8971 9.4999 1.7953 0.2618 3.0856 1.5453 5.7708 10.1076 6.1613 53.3592 2.0250 5.7593 8.8367 13.4722 9.3566 5.6769 33.9170 35.5742 19.8817 4.9626 44.9134 5.4534 1.7438 4.6252 0.9228 2.6319 19.6553 20.0340 84.7074 0.7645 8.9698 14.5156 32.7002 64.0648 6.2170 27.7665 24.6800 31.8192 11.4032 106.5515 57.2792 15.2133 0.1547 13.3140 27.4184 21.3299 30.7112
temp: 298.150 k
press: 1.00000 atm
elementType: 7 7 6 6 6 6 6 6 6 6 6 6 6 6 1 1 1 1 1 1 1 1 1 1 1 1 1 1 1 1
symmnumber: 1
zpe: 669147.0 jmol-1
zpe.correction: 0.254865 hartree
zpe.thermalcorrener: 0.268262 hartree
zpe.thermalcorrenthalpy: 0.269207 hartree
zpe.thermalcorrgfe: 0.210891 hartree
zpe.sumelectzpe: -575.357739 hartree
zpe.sumelectthermal: -575.344341 hartree
zpe.sumelectthermalent: -575.343397 hartree
zpe.sumelectthermalfe: -575.401713 hartree
dipole: 1.8424 3.3840 0.2901
dipole: 3.8639
quadrupole: -76.7579 -80.8988 -88.3263
quadrupole: -0.9127 -0.9520 -0.8446
quadrupole: 5.2364 1.0955 -6.3320 -0.9127 -0.9520 -0.8446
hfenergy: -575.6126033 hartree
pointgroup: C01 [X(C12H16N2)]
dipole: 0.7206956 1.3115388 0.2673088 debye
polarizability: 211.4905396|2.8844715|133.9896918|-9.8563694|7.8129898|84.5713667 unknown
InChI: InChI=1S/C12H16N2/c1-9(2)7-8-12-13-10-5-3-4-6-11(10)14-12/h3-6,9,13H,7-8H2,1-2H3
charge 0 multiplicity 1
30 atoms
N  -0.387735 1.046871 -0.122436
N  -0.477333 -1.200811 -0.499122
C  4.146048 0.105903 0.559693
C  2.597273 0.103832 0.70234
C  1.816825 -0.131361 -0.624078
C  0.328184 -0.12589 -0.429124
C  4.690533 -1.241741 0.026811
C  4.658935 1.290036 -0.296013
C  -1.741658 0.703531 0.013528
C  -1.779613 -0.714135 -0.226976
C  -2.898255 1.453159 0.308263
C  -3.011552 -1.403648 -0.170363
C  -4.118714 0.743937 0.359973
C  -4.174464 -0.661017 0.124583
H  4.546664 0.242399 1.586893
H  2.282692 1.070737 1.147723
H  2.298909 -0.685299 1.420131
H  2.10288 0.636177 -1.370146
H  2.078475 -1.116222 -1.044316
H  5.795631 -1.257953 0.061316
H  4.390467 -1.412031 -1.023901
H  4.318232 -2.092082 0.628074
H  4.277067 2.257085 0.083442
H  4.349208 1.190796 -1.353295
H  5.763697 1.334219 -0.281172
H  0.013175 1.977277 -0.019579
H  -2.865878 2.532687 0.49066
H  -3.048429 -2.482116 -0.35188
H  -5.043963 1.285526 0.586171
H  -5.1426 -1.171267 0.174798
