program: Gaussian 09
title: 000135855
version: EM64L-G09RevD.01
frameworkgroup: C1[X(C8H11O)]
method: RPBEPBE
basis: SDD
operation: Freq
keyword: #p
keyword: freq=noraman
keyword: PBEPBE/SDD
title: #p freq=noraman PBEPBE/SDD
converged: YES YES NO NO
title: Mulliken charges:
elementType: O C C C C C C C C H H H H H H H H H H H
charge: -0.184386 0.484694 0.349025 0.349192 -0.417657 -0.380927 -0.770952 -0.737172 -0.737596 0.288384 0.285638 0.274961 0.258026 0.274959 0.284097 0.284137 0.264577 0.283683 0.263638 0.283680
chargesum: 1.00000
title: Mulliken charges with hydrogens summed into heavy atoms:
elementType: O C C C C C C C C
charge: -0.184386 0.484694 0.349025 0.349192 -0.129274 -0.095289 0.036994 0.095638 0.093405
polarizability: 1.12302116e+02 1.18115569e+00 1.06959025e+02 -3.98598471e-03 -4.05728056e-03 4.95453486e+01
1716.lowfreq: -23.9979 -9.0048 -8.4433 -0.0007 -0.0005 0.0003 11.7485 68.0835 74.8248
frequency: -23.8238 68.0771 74.7811 168.4367 187.7545 207.2163 265.8522 271.4309 447.3232 492.3075 518.2393 520.3043 538.8587 577.2638 693.6089 844.4889 867.8331 914.3266 922.2450 958.8464 1016.0672 1023.3769 1030.0669 1040.1676 1042.9156 1046.5606 1149.7878 1159.8540 1263.4962 1313.7130 1386.4697 1392.4447 1404.2106 1409.7298 1427.6208 1441.4758 1441.9771 1450.0874 1454.2252 1465.5230 1493.7527 1537.4326 1633.2089 2986.3899 2997.6761 2998.0494 3059.0422 3075.0733 3075.7056 3122.6497 3133.0776 3133.8092 3181.4384 3186.6235
redmass: 1.0272 1.0358 1.0371 2.7729 2.8881 4.3827 2.4950 2.5166 2.5649 6.0273 5.0946 3.0870 2.9893 4.2891 3.1839 3.4836 1.2013 1.2755 2.8990 4.8715 1.7284 1.7852 1.5590 1.6805 1.5768 1.5997 5.5515 1.7212 1.3708 3.0454 1.3077 2.1914 1.2282 1.2539 1.5997 1.0422 1.0416 1.0439 1.1754 1.2291 1.7768 5.0390 5.8175 1.0402 1.0394 1.0394 1.0951 1.0964 1.0965 1.0990 1.0991 1.0991 1.0941 1.0950
irintensity: 1.8336 0.1126 2.0509 3.3776 0.0580 5.7684 0.9821 0.3204 1.0134 2.2301 0.5718 2.3180 0.0004 0.1284 2.0819 7.7383 16.2211 0.3577 4.8192 1.4709 17.6227 3.8216 2.9893 22.6843 20.5878 2.2756 15.1199 4.6877 3.7129 10.9017 61.0380 26.2570 56.4789 53.7450 6.9626 4.9657 43.9038 22.0661 15.6325 54.7966 25.6447 283.1197 283.1760 8.1470 8.6480 8.0341 0.1526 0.0034 0.0000 9.9650 3.1562 2.1550 1.4261 2.0242
temp: 298.150 k
press: 1.00000 atm
elementType: 8 6 6 6 6 6 6 6 6 1 1 1 1 1 1 1 1 1 1 1
symmnumber: 1
zpe: 439704.7 jmol-1
zpe.correction: 0.167475 hartree
zpe.thermalcorrener: 0.176562 hartree
zpe.thermalcorrenthalpy: 0.177506 hartree
zpe.thermalcorrgfe: 0.133166 hartree
zpe.sumelectzpe: -385.751080 hartree
zpe.sumelectthermal: -385.741992 hartree
zpe.sumelectthermalent: -385.741048 hartree
zpe.sumelectthermalfe: -385.785388 hartree
dipole: 0.8039 0.0817 0.0008
dipole: 0.8080
quadrupole: -33.0834 -30.2328 -52.2010
quadrupole: 0.5512 -0.0013 -0.0020
quadrupole: 5.4224 8.2729 -13.6952 0.5512 -0.0013 -0.0020
hfenergy: -385.9185546 hartree
pointgroup: C01 [X(C8H11O1)]
dipole: -0.3112652 0.064575 -0.0003218 debye
dipolederiv: -0.4875665 -0.0206967 -0.0000439 -0.0310459 -0.7312397 0.000006 0.0000655 -0.000049 -0.113443 1.0404937 -0.065615 0. -0.0844647 0.698349 0.0000257 0.0000452 -0.0000639 0.1223847 0.83237 -0.6946128 -0.0001795 -0.2338779 0.8243638 0.000154 -0.000561 0.0006383 0.1481017 0.9493659 0.6482792 0.0000569 0.2140013 0.6652979 -0.0000271 0.0000702 -0.0000051 0.1368654 -0.5993365 0.713495 0.0000925 0.3851925 -0.434501 0.0000017 0.0001066 0.0000057 -0.0831795 -0.7537998 -0.638147 -0.0000257 -0.3203595 -0.2492498 -0.0000353 0.0000017 0.0000038 -0.1102246 -0.4727983 0.0948537 -0.0000089 0.3322418 -0.0149478 -0.0000043 -0.000041 0.0000316 -0.0524035 -0.2777624 0.4032512 0.000142 0.1520403 -0.2402696 -0.0001908 0.0010057 -0.001573 -0.034794 -0.3569612 -0.3699407 -0.0000084 -0.1277474 -0.1466242 -0.0000071 -0.0001196 -0.0001171 -0.0280069 0.103811 -0.0386516 -0.0000163 -0.02242 0.0548504 0.0000179 -0.000033 0.0000221 0.1566697 0.1147777 0.0270635 -0.0000012 0.0122542 0.0456765 0.0000086 0. 0.0000031 0.1550623 0.1073497 -0.011551 -0.001063 -0.0837088 0.0954615 -0.0851896 0.0138162 -0.0722651 0.0453235 0.06939 -0.0099772 -0.0000017 -0.0875316 -0.0478015 0.0000134 0.0000023 0.0000125 0.1322685 0.1073442 -0.0115431 0.0010681 -0.0837136 0.095483 0.0851793 -0.0138026 0.0722566 0.0452847 0.1395079 -0.0420862 -0.0632375 0.0104994 0.0798472 -0.0391836 -0.0613155 -0.0224526 0.0502484 0.1399637 -0.0417227 0.0629069 0.0108721 0.0800282 0.039021 0.0606523 0.0230351 0.0496474 0.0211204 -0.0967783 0.000322 -0.0379375 0.0472726 0.0002018 0.0000456 0.0004404 0.1420664 0.1399343 0.0282235 -0.0554727 -0.0211703 0.0771687 0.0495883 -0.0573815 0.0315869 0.0481028 0.0428875 0.0978975 -0.0000257 0.0380005 0.0236902 0.000027 -0.0000018 0.0000402 0.1418716 0.1399088 0.0282588 0.0554961 -0.0211248 0.0771445 -0.0496068 0.0574448 -0.0315505 0.0481546 unknown
polarizability: 112.0030221|-1.7040419|107.2581192|-0.0035464|0.0044467|49.5453486 unknown
InChI: InChI=1S/C8H11O/c1-6-4-7(2)9-8(3)5-6/h4-5H,1-3H3
charge 1 multiplicity 1
20 atoms
O  1.311347 -0.102623 -0.000112
C  -1.479147 0.127307 -0.000121
C  0.545991 -1.260607 0.000079
C  0.744991 1.167761 -0.000204
C  -0.846768 -1.149625 -0.000004
C  -0.644299 1.284791 -0.000188
C  -2.974486 0.261543 -0.000191
C  1.365422 -2.504958 -0.000367
C  1.759568 2.258873 -0.00021
H  -1.443012 -2.064881 -0.000029
H  -1.081537 2.286457 -0.000248
H  -3.314562 0.83372 0.88411
H  -3.485827 -0.71252 -0.000129
H  -3.314487 0.833562 -0.884624
H  2.025983 -2.539301 0.885544
H  2.022134 -2.541153 -0.889114
H  0.723372 -3.397891 0.001817
H  2.414598 2.18504 0.887362
H  1.274338 3.245934 -0.000424
H  2.414882 2.184771 -0.887546
