program: Gaussian 09
title: 000135842
version: EM64L-G09RevD.01
frameworkgroup: C1[X(C11H14O)]
method: RPBEPBE
basis: SDD
operation: Freq
keyword: #pfreq=noraman
keyword: PBEPBE/SDD
title: #p freq=noraman PBEPBE/SDD
converged: YES YES NO NO
title: Mulliken charges:
elementType: O C C C C C C C C C C C H H H H H H H H H H H H H H
charge: -0.299636 -0.003048 -0.428652 -0.369963 -0.580477 0.511357 -0.404721 -0.403469 0.433026 -0.386364 -0.387673 -0.806549 0.227491 0.219627 0.232247 0.217350 0.213355 0.206631 0.215223 0.229085 0.228293 0.226847 0.226800 0.223831 0.224003 0.235388
chargesum: 0.00000
title: Mulliken charges with hydrogens summed into heavy atoms:
elementType: O C C C C C C C C C C C
charge: -0.299636 0.224443 0.023221 0.060743 -0.158623 0.511357 -0.175636 -0.175176 0.433026 -0.159517 -0.160873 -0.123328
polarizability: 1.63257488e+02 2.58000791e+00 1.14453596e+02 -1.37676685e+01 -1.49327820e+00 7.66048090e+01
1716.lowfreq: -18.1185 -0.0004 0.0001 0.0006 5.8059 7.1586 19.5152 25.5210 44.7766
frequency: -17.4112 24.7326 44.6190 59.6444 88.2982 154.8189 206.9729 279.9073 310.9787 368.2763 395.6411 406.5008 411.0832 488.8689 538.7918 639.7761 714.1419 723.9409 760.0360 772.3069 798.0362 817.9433 834.7872 849.4943 898.5039 947.7105 968.1905 971.5808 987.0989 1007.0063 1014.8102 1030.4868 1047.7060 1065.7303 1099.4394 1119.1427 1129.7732 1188.0666 1191.6467 1217.5489 1224.0650 1232.7193 1261.1691 1283.5422 1315.8167 1335.8410 1376.0657 1393.1897 1397.7261 1407.5615 1465.8581 1472.9794 1473.8687 1479.7916 1484.7292 1510.3013 1585.6412 1626.5276 2974.4625 2978.6622 2998.1746 3028.3692 3055.3508 3055.8044 3059.3780 3076.8712 3083.7673 3108.1257 3109.7607 3130.9472 3137.6883 3164.3654
redmass: 1.0560 3.2954 3.1905 3.8367 2.9653 4.0299 3.9517 2.3386 4.7467 2.3307 2.5460 2.9208 3.2035 3.9739 2.8148 6.7097 5.2101 3.2493 3.2231 1.9031 1.8524 2.2469 2.6672 1.2486 1.3126 1.3577 1.7286 1.3831 1.4010 2.3407 2.6889 1.9144 1.5581 1.5173 1.2953 1.2920 1.2892 1.5164 1.1076 3.5402 2.2791 1.5093 1.2732 1.2972 1.2664 1.4341 5.1157 1.9688 1.2248 2.7906 1.1338 1.0933 1.0543 1.1744 1.1060 2.7616 6.0325 6.4926 1.0386 1.0594 1.0603 1.1008 1.0951 1.0858 1.0647 1.0955 1.0997 1.0869 1.0870 1.0961 1.0973 1.1187
irintensity: 0.5118 1.8299 0.2893 1.4788 2.6940 4.3517 1.9145 0.6325 4.5593 0.3455 2.3977 1.0674 6.5184 12.7385 24.4709 0.0305 3.5391 2.9798 1.2462 17.3277 11.5639 39.4255 26.4313 0.0760 1.2212 2.6046 4.0940 0.0030 1.6038 0.5542 3.9449 3.5775 16.8623 2.7595 4.0657 13.1985 6.7510 6.5496 0.1696 0.0069 0.8396 7.7149 0.8463 2.8133 0.1892 1.4116 0.2229 16.4865 10.3183 0.9259 2.4293 13.7937 12.5892 4.2918 14.3691 40.4362 0.2319 0.2754 41.5243 24.0386 28.8532 6.4850 24.5740 0.6190 46.0408 41.0571 19.9123 1.5501 29.8649 51.6887 0.6640 38.9108
temp: 298.150 k
press: 1.00000 atm
elementType: 8 6 6 6 6 6 6 6 6 6 6 6 1 1 1 1 1 1 1 1 1 1 1 1 1 1
symmnumber: 1
zpe: 573389.0 jmol-1
zpe.correction: 0.218392 hartree
zpe.thermalcorrener: 0.229718 hartree
zpe.thermalcorrenthalpy: 0.230662 hartree
zpe.thermalcorrgfe: 0.179155 hartree
zpe.sumelectzpe: -501.850212 hartree
zpe.sumelectthermal: -501.838886 hartree
zpe.sumelectthermalent: -501.837942 hartree
zpe.sumelectthermalfe: -501.889449 hartree
dipole: -1.6346 0.3353 -1.9164
dipole: 2.5411
quadrupole: -75.1326 -65.1718 -77.8707
quadrupole: 1.8581 -13.3554 0.0991
quadrupole: -2.4075 7.5532 -5.1457 1.8581 -13.3554 0.0991
hfenergy: -502.0686041 hartree
pointgroup: C01 [X(C11H14O1)]
dipole: 0.6499845 0.1097584 0.7516199 debye
dipolederiv: -0.6865915 -0.0459686 -0.1387675 -0.0295719 -0.2883238 -0.0260691 -0.2352169 -0.017579 -0.5783028 0.5543114 0.0075566 -0.0132903 0.1076438 0.2628079 -0.0209613 -0.0419735 -0.0973446 0.2265818 -0.1419483 -0.0345133 -0.0034958 -0.0365513 0.0877057 0.0308482 0.1394858 0.0518682 0.0438114 0.1640299 0.1207389 -0.0336663 0.0613341 0.1778983 -0.0294983 -0.1189255 0.0599247 0.214069 -0.0933487 0.0034468 -0.0158695 -0.0218907 0.1681831 -0.0084505 -0.0943598 -0.0229454 0.1343992 0.358455 0.0267902 -0.0466923 0.0427013 -0.0731096 -0.0013412 -0.0872141 0.0063264 -0.0831628 -0.1344411 0.0132483 -0.033215 0.0711437 0.0839522 -0.013109 -0.0000273 0.0121704 -0.1475222 -0.1181961 -0.0276512 -0.0421251 -0.1020693 0.0563107 0.0412926 -0.0180389 0.0190943 -0.1424403 0.3161898 0.0398988 -0.1191505 0.0463006 -0.0672263 -0.0167665 -0.1927839 -0.0212786 0.0160074 -0.1177727 -0.0477074 -0.019429 -0.1477602 0.0682464 0.0529522 -0.0150981 0.0310715 -0.1549684 -0.1427574 0.015464 -0.0078606 0.1130259 0.1010031 -0.0157707 0.007338 0.0059681 -0.162592 -0.0876325 -0.0175778 0.0543202 -0.0248243 0.0802021 0.0084275 0.1618012 0.0161076 0.0274515 -0.0265281 -0.0044453 0.0136975 -0.0298684 -0.0929331 0.1150399 0.0342615 0.0996536 0.0314487 0.0529569 -0.0204442 -0.0072132 -0.0279399 -0.0762522 0.104164 0.0171856 0.0564332 0.0265252 0.021826 0.0692305 0.0319499 0.0373115 -0.0245442 -0.1159959 0.05208 -0.0812575 -0.0129838 -0.0703963 -0.0042709 0.1288324 -0.0098599 0.0563127 -0.0134638 0.1405054 -0.0453068 -0.0192008 0.0702571 -0.1103536 0.0247104 -0.0686611 -0.1077824 -0.034878 0.0540968 -0.0117547 0.0518483 0.023021 -0.0220863 0.0236734 -0.0591291 -0.0954614 0.1286613 0.030766 0.0664806 0.0065806 0.0081222 0.0211298 0.0444709 0.0617471 -0.0446146 -0.1317762 0.049386 -0.0700737 -0.0285126 0.0436159 -0.103156 0.0312843 -0.0966329 -0.0776089 0.0129613 0.0266185 0.0172781 0.1318559 0.0100475 0.1088422 0.0519667 0.1052722 -0.0385108 -0.0363778 0.0479815 -0.0408323 0.1221098 -0.0063279 0.1072208 0.0404587 0.1032251 -0.0466434 -0.0373628 0.0447036 -0.035902 0.1356481 0.0263912 -0.0964715 0.0203905 -0.0963253 -0.0855166 0.009545 0.0250648 0.0076903 0.1431152 0.0049537 -0.0419688 -0.0033929 -0.1276501 -0.0709253 -0.0800596 -0.0631207 -0.0853129 0.0700608 -0.0259078 0.0535507 -0.0075714 0.1451391 -0.061905 0.0572509 -0.054031 0.0541325 0.0906367 -0.0023291 -0.0105028 0.0259845 -0.0161101 0.1087356 0.0207377 0.0895151 0.025388 -0.1424639 unknown
polarizability: 162.9966362|-1.8636239|114.2933703|-14.7033292|2.7030297|77.0258863 unknown
InChI: InChI=1S/C11H14O/c1-9-2-4-10(5-3-9)6-7-11-8-12-11/h2-5,11H,6-8H2,1H3
charge 0 multiplicity 1
26 atoms
O  -4.462868 -0.04158 -1.035909
C  -3.446513 -0.446671 0.011818
C  -1.985765 -0.271994 -0.355628
C  -4.345942 0.727117 0.258813
C  -1.06817 -0.310065 0.902728
C  0.40387 -0.164253 0.545876
C  1.203608 -1.299239 0.25889
C  1.008468 1.114695 0.449994
C  3.162893 0.119207 -0.215695
C  2.558841 -1.160231 -0.11331
C  2.363613 1.253818 0.077644
C  4.61241 0.27019 -0.645828
H  -3.704996 -1.394879 0.507268
H  -1.852159 0.68744 -0.889421
H  -1.681809 -1.071638 -1.058024
H  -5.204556 0.628598 0.934637
H  -3.936402 1.740512 0.152309
H  -1.235976 -1.265181 1.438649
H  -1.376622 0.501241 1.590469
H  0.763606 -2.301791 0.336509
H  0.41536 2.009649 0.67826
H  3.157765 -2.055324 -0.323008
H  2.809211 2.254673 0.017886
H  5.072559 1.174821 -0.210386
H  5.218515 -0.601392 -0.341344
H  4.69406 0.357978 -1.746898
